{"text_format":"1","workbook":"xlsx","n_sheets":13,"sheets":["Instrukcija","Sakuma lapa","UIN Data","UIN","2","5.1","6.2","8","9.1.1","15","31.2","Tiesibas","Symbols"],"not_rendered":{"charts":0,"images":1,"macros":1,"external_links":0,"defined_names":18,"comments":0,"pivot_tables":0},"unopened":[],"bounds":{"document_bytes":16777216,"sheet_cells":100000,"rows_first":2000,"rows_last":500,"rows_between":2000,"halvings":0,"cell_chars":16384,"cell_head_chars":4096},"cells_cut":0,"cells_raw":0,"read":"whole","date_system":"1900"}

{"sheet":"Instrukcija","index":0,"n_rows":6,"n_cols":4,"rows_kept":6,"cut":false,"hidden":false,"merged":[[1,2,1,8],[2,3,2,8],[3,3,3,8]]}
[]
[null,"Apraksts:","https://exceldarbariki.mozello.lv/produkti/uin/"]
[null,"Kā ieslēgt makrosus:",null,"https://exceldarbariki.mozello.lv/produkti/instrukcijas/"]
[null,"Kā atbloķēt makrosus:",null,"https://exceldarbariki.mozello.lv/produkti/ka-atbloket-makrosus/"]
[]
[null,"Nepieciešams ieiet EDS izlādēt (aktuālas = pēdējas) UIN deklarācijas XML formātā par visu pārskata periodu (līdz 12 mēnešiem)."]

{"sheet":"Sakuma lapa","index":1,"n_rows":6,"n_cols":11,"rows_kept":6,"cut":false,"hidden":false,"merged":[[5,8,5,10],[1,7,1,9],[2,7,2,9],[3,1,3,3],[5,2,5,3]]}
[]
[null,null,null,null,null,null,null,"Decimālais atdalītais",null,null,{"$f":"MID(1/10,2,1)","v":"."}]
[null,null,null,null,null,null,null,"Tūkstošu atdalītais"]
[null,"Nolasītais periods"]
[]
[null,"Gads","RegNr.",null,"Mēnesis","DokId",null,"Uzņemums"]

{"sheet":"UIN Data","index":2,"n_rows":2,"n_cols":9,"rows_kept":2,"cut":false,"hidden":true,"merged":[]}
[]
[null,"Id","Reg.Nr.","Gads","Menesis","Ceturksnis","Rinda","UINID","Summa"]

{"sheet":"UIN","index":3,"n_rows":160,"n_cols":18,"rows_kept":160,"cut":false,"hidden":false,"merged":[[1,3,1,5],[66,3,66,17],[72,3,72,17],[94,3,94,17],[100,3,100,17],[125,3,125,17],[146,3,146,17],[27,3,27,17],[3,3,3,17],[7,4,7,17],[16,4,16,17],[22,4,22,17],[44,4,44,17]]}
[null,null,null,null,null,{"$f":"'Sakuma lapa'!I6","v":0},0,1,2,3,4,5,6,7,8,9,10,11]
[null,null,null,"Periods",null,null,{"$f":"YEAR(DATE(YEAR('Sakuma lapa'!$E$4),MONTH('Sakuma lapa'!$E$4)+G1,1))&RIGHT(0&MONTH(DATE(YEAR('Sakuma lapa'!$E$4),MONTH('Sakuma lapa'!$E$4)+G1,1)),2)","v":"190001"},{"$f":"YEAR(DATE(YEAR('Sakuma lapa'!$E$4),MONTH('Sakuma lapa'!$E$4)+H1,1))&RIGHT(0&MONTH(DATE(YEAR('Sakuma lapa'!$E$4),MONTH('Sakuma lapa'!$E$4)+H1,1)),2)","v":"190002"},{"$f":"YEAR(DATE(YEAR('Sakuma lapa'!$E$4),MONTH('Sakuma lapa'!$E$4)+I1,1))&RIGHT(0&MONTH(DATE(YEAR('Sakuma lapa'!$E$4),MONTH('Sakuma lapa'!$E$4)+I1,1)),2)","v":"190003"},{"$f":"YEAR(DATE(YEAR('Sakuma lapa'!$E$4),MONTH('Sakuma lapa'!$E$4)+J1,1))&RIGHT(0&MONTH(DATE(YEAR('Sakuma lapa'!$E$4),MONTH('Sakuma lapa'!$E$4)+J1,1)),2)","v":"190004"},{"$f":"YEAR(DATE(YEAR('Sakuma lapa'!$E$4),MONTH('Sakuma lapa'!$E$4)+K1,1))&RIGHT(0&MONTH(DATE(YEAR('Sakuma lapa'!$E$4),MONTH('Sakuma lapa'!$E$4)+K1,1)),2)","v":"190005"},{"$f":"YEAR(DATE(YEAR('Sakuma lapa'!$E$4),MONTH('Sakuma lapa'!$E$4)+L1,1))&RIGHT(0&MONTH(DATE(YEAR('Sakuma lapa'!$E$4),MONTH('Sakuma lapa'!$E$4)+L1,1)),2)","v":"190006"},{"$f":"YEAR(DATE(YEAR('Sakuma lapa'!$E$4),MONTH('Sakuma lapa'!$E$4)+M1,1))&RIGHT(0&MONTH(DATE(YEAR('Sakuma lapa'!$E$4),MONTH('Sakuma lapa'!$E$4)+M1,1)),2)","v":"190007"},{"$f":"YEAR(DATE(YEAR('Sakuma lapa'!$E$4),MONTH('Sakuma lapa'!$E$4)+N1,1))&RIGHT(0&MONTH(DATE(YEAR('Sakuma lapa'!$E$4),MONTH('Sakuma lapa'!$E$4)+N1,1)),2)","v":"190008"},{"$f":"YEAR(DATE(YEAR('Sakuma lapa'!$E$4),MONTH('Sakuma lapa'!$E$4)+O1,1))&RIGHT(0&MONTH(DATE(YEAR('Sakuma lapa'!$E$4),MONTH('Sakuma lapa'!$E$4)+O1,1)),2)","v":"190009"},{"$f":"YEAR(DATE(YEAR('Sakuma lapa'!$E$4),MONTH('Sakuma lapa'!$E$4)+P1,1))&RIGHT(0&MONTH(DATE(YEAR('Sakuma lapa'!$E$4),MONTH('Sakuma lapa'!$E$4)+P1,1)),2)","v":"190010"},{"$f":"YEAR(DATE(YEAR('Sakuma lapa'!$E$4),MONTH('Sakuma lapa'!$E$4)+Q1,1))&RIGHT(0&MONTH(DATE(YEAR('Sakuma lapa'!$E$4),MONTH('Sakuma lapa'!$E$4)+Q1,1)),2)","v":"190011"},{"$f":"YEAR(DATE(YEAR('Sakuma lapa'!$E$4),MONTH('Sakuma lapa'!$E$4)+R1,1))&RIGHT(0&MONTH(DATE(YEAR('Sakuma lapa'!$E$4),MONTH('Sakuma lapa'!$E$4)+R1,1)),2)","v":"190012"}]
[]
[null,null,null,"Vai nodokļu maksātājam uz 2017.gada 31.decembri ir nesadalītā peļņa, iepriekšējo gadu nodokļa zaudējumi, kuri līdz taksācijas periodam nav pārnesti, vai uzkrājumi?"]
[null,"IeprZaudejumi",null,null,null,"Jā",{"$f":"IF(ISNA(VLOOKUP(G$2&$B5,'UIN Data'!$H:$I,2,0)),\"\",IF(VLOOKUP(G$2&$B5,'UIN Data'!$H:$I,2,0)=TRUE,\"X\",\"\"))","v":""},{"$f":"IF(ISNA(VLOOKUP(H$2&$B5,'UIN Data'!$H:$I,2,0)),\"\",IF(VLOOKUP(H$2&$B5,'UIN Data'!$H:$I,2,0)=TRUE,\"X\",\"\"))","v":""},{"$f":"IF(ISNA(VLOOKUP(I$2&$B5,'UIN Data'!$H:$I,2,0)),\"\",IF(VLOOKUP(I$2&$B5,'UIN Data'!$H:$I,2,0)=TRUE,\"X\",\"\"))","v":""},{"$f":"IF(ISNA(VLOOKUP(J$2&$B5,'UIN Data'!$H:$I,2,0)),\"\",IF(VLOOKUP(J$2&$B5,'UIN Data'!$H:$I,2,0)=TRUE,\"X\",\"\"))","v":""},{"$f":"IF(ISNA(VLOOKUP(K$2&$B5,'UIN Data'!$H:$I,2,0)),\"\",IF(VLOOKUP(K$2&$B5,'UIN Data'!$H:$I,2,0)=TRUE,\"X\",\"\"))","v":""},{"$f":"IF(ISNA(VLOOKUP(L$2&$B5,'UIN Data'!$H:$I,2,0)),\"\",IF(VLOOKUP(L$2&$B5,'UIN Data'!$H:$I,2,0)=TRUE,\"X\",\"\"))","v":""},{"$f":"IF(ISNA(VLOOKUP(M$2&$B5,'UIN Data'!$H:$I,2,0)),\"\",IF(VLOOKUP(M$2&$B5,'UIN Data'!$H:$I,2,0)=TRUE,\"X\",\"\"))","v":""},{"$f":"IF(ISNA(VLOOKUP(N$2&$B5,'UIN Data'!$H:$I,2,0)),\"\",IF(VLOOKUP(N$2&$B5,'UIN Data'!$H:$I,2,0)=TRUE,\"X\",\"\"))","v":""},{"$f":"IF(ISNA(VLOOKUP(O$2&$B5,'UIN Data'!$H:$I,2,0)),\"\",IF(VLOOKUP(O$2&$B5,'UIN Data'!$H:$I,2,0)=TRUE,\"X\",\"\"))","v":""},{"$f":"IF(ISNA(VLOOKUP(P$2&$B5,'UIN Data'!$H:$I,2,0)),\"\",IF(VLOOKUP(P$2&$B5,'UIN Data'!$H:$I,2,0)=TRUE,\"X\",\"\"))","v":""},{"$f":"IF(ISNA(VLOOKUP(Q$2&$B5,'UIN Data'!$H:$I,2,0)),\"\",IF(VLOOKUP(Q$2&$B5,'UIN Data'!$H:$I,2,0)=TRUE,\"X\",\"\"))","v":""},{"$f":"IF(ISNA(VLOOKUP(R$2&$B5,'UIN Data'!$H:$I,2,0)),\"\",IF(VLOOKUP(R$2&$B5,'UIN Data'!$H:$I,2,0)=TRUE,\"X\",\"\"))","v":""}]
[null,"IeprZaudejumi",null,null,null,"Nē",{"$f":"IF(ISNA(VLOOKUP(G$2&$B6,'UIN Data'!$H:$I,2,0)),\"\",IF(VLOOKUP(G$2&$B6,'UIN Data'!$H:$I,2,0)=FALSE,\"X\",\"\"))","v":""},{"$f":"IF(ISNA(VLOOKUP(H$2&$B6,'UIN Data'!$H:$I,2,0)),\"\",IF(VLOOKUP(H$2&$B6,'UIN Data'!$H:$I,2,0)=FALSE,\"X\",\"\"))","v":""},{"$f":"IF(ISNA(VLOOKUP(I$2&$B6,'UIN Data'!$H:$I,2,0)),\"\",IF(VLOOKUP(I$2&$B6,'UIN Data'!$H:$I,2,0)=FALSE,\"X\",\"\"))","v":""},{"$f":"IF(ISNA(VLOOKUP(J$2&$B6,'UIN Data'!$H:$I,2,0)),\"\",IF(VLOOKUP(J$2&$B6,'UIN Data'!$H:$I,2,0)=FALSE,\"X\",\"\"))","v":""},{"$f":"IF(ISNA(VLOOKUP(K$2&$B6,'UIN Data'!$H:$I,2,0)),\"\",IF(VLOOKUP(K$2&$B6,'UIN Data'!$H:$I,2,0)=FALSE,\"X\",\"\"))","v":""},{"$f":"IF(ISNA(VLOOKUP(L$2&$B6,'UIN Data'!$H:$I,2,0)),\"\",IF(VLOOKUP(L$2&$B6,'UIN Data'!$H:$I,2,0)=FALSE,\"X\",\"\"))","v":""},{"$f":"IF(ISNA(VLOOKUP(M$2&$B6,'UIN Data'!$H:$I,2,0)),\"\",IF(VLOOKUP(M$2&$B6,'UIN Data'!$H:$I,2,0)=FALSE,\"X\",\"\"))","v":""},{"$f":"IF(ISNA(VLOOKUP(N$2&$B6,'UIN Data'!$H:$I,2,0)),\"\",IF(VLOOKUP(N$2&$B6,'UIN Data'!$H:$I,2,0)=FALSE,\"X\",\"\"))","v":""},{"$f":"IF(ISNA(VLOOKUP(O$2&$B6,'UIN Data'!$H:$I,2,0)),\"\",IF(VLOOKUP(O$2&$B6,'UIN Data'!$H:$I,2,0)=FALSE,\"X\",\"\"))","v":""},{"$f":"IF(ISNA(VLOOKUP(P$2&$B6,'UIN Data'!$H:$I,2,0)),\"\",IF(VLOOKUP(P$2&$B6,'UIN Data'!$H:$I,2,0)=FALSE,\"X\",\"\"))","v":""},{"$f":"IF(ISNA(VLOOKUP(Q$2&$B6,'UIN Data'!$H:$I,2,0)),\"\",IF(VLOOKUP(Q$2&$B6,'UIN Data'!$H:$I,2,0)=FALSE,\"X\",\"\"))","v":""},{"$f":"IF(ISNA(VLOOKUP(R$2&$B6,'UIN Data'!$H:$I,2,0)),\"\",IF(VLOOKUP(R$2&$B6,'UIN Data'!$H:$I,2,0)=FALSE,\"X\",\"\"))","v":""}]
[]
[null,null,null,null,"1.1. Nesadalītā peļņa uz 2017.gada 31.decembri, kuru sadales brīdī neietver ar UIN apliekamajā bāzē"]
[null,"Tab1_1PelnaNesadalita",null,null,null,"Nesadalītā peļņa uz 31.12.2017",{"$f":"SUMIF('UIN Data'!$H:$H,G$2&$B9,'UIN Data'!$I:$I)","v":0},{"$f":"SUMIF('UIN Data'!$H:$H,H$2&$B9,'UIN Data'!$I:$I)","v":0},{"$f":"SUMIF('UIN Data'!$H:$H,I$2&$B9,'UIN Data'!$I:$I)","v":0},{"$f":"SUMIF('UIN Data'!$H:$H,J$2&$B9,'UIN Data'!$I:$I)","v":0},{"$f":"SUMIF('UIN Data'!$H:$H,K$2&$B9,'UIN Data'!$I:$I)","v":0},{"$f":"SUMIF('UIN Data'!$H:$H,L$2&$B9,'UIN Data'!$I:$I)","v":0},{"$f":"SUMIF('UIN Data'!$H:$H,M$2&$B9,'UIN Data'!$I:$I)","v":0},{"$f":"SUMIF('UIN Data'!$H:$H,N$2&$B9,'UIN Data'!$I:$I)","v":0},{"$f":"SUMIF('UIN Data'!$H:$H,O$2&$B9,'UIN Data'!$I:$I)","v":0},{"$f":"SUMIF('UIN Data'!$H:$H,P$2&$B9,'UIN Data'!$I:$I)","v":0},{"$f":"SUMIF('UIN Data'!$H:$H,Q$2&$B9,'UIN Data'!$I:$I)","v":0},{"$f":"SUMIF('UIN Data'!$H:$H,R$2&$B9,'UIN Data'!$I:$I)","v":0}]
[null,"Tab1_1Samazina",null,null,null,"Finanšu grāmatvedībā aprēķinātie zaudējumi, kas samazina nesadalīto peļņu",{"$f":"SUMIF('UIN Data'!$H:$H,G$2&$B10,'UIN Data'!$I:$I)","v":0},{"$f":"SUMIF('UIN Data'!$H:$H,H$2&$B10,'UIN Data'!$I:$I)","v":0},{"$f":"SUMIF('UIN Data'!$H:$H,I$2&$B10,'UIN Data'!$I:$I)","v":0},{"$f":"SUMIF('UIN Data'!$H:$H,J$2&$B10,'UIN Data'!$I:$I)","v":0},{"$f":"SUMIF('UIN Data'!$H:$H,K$2&$B10,'UIN Data'!$I:$I)","v":0},{"$f":"SUMIF('UIN Data'!$H:$H,L$2&$B10,'UIN Data'!$I:$I)","v":0},{"$f":"SUMIF('UIN Data'!$H:$H,M$2&$B10,'UIN Data'!$I:$I)","v":0},{"$f":"SUMIF('UIN Data'!$H:$H,N$2&$B10,'UIN Data'!$I:$I)","v":0},{"$f":"SUMIF('UIN Data'!$H:$H,O$2&$B10,'UIN Data'!$I:$I)","v":0},{"$f":"SUMIF('UIN Data'!$H:$H,P$2&$B10,'UIN Data'!$I:$I)","v":0},{"$f":"SUMIF('UIN Data'!$H:$H,Q$2&$B10,'UIN Data'!$I:$I)","v":0},{"$f":"SUMIF('UIN Data'!$H:$H,R$2&$B10,'UIN Data'!$I:$I)","v":0}]
[null,"Tab1_1Korekcija",null,null,null,"Citas koriģējošas summas (norāda summu ar “+” vai “-” zīmi)",{"$f":"SUMIF('UIN Data'!$H:$H,G$2&$B11,'UIN Data'!$I:$I)","v":0},{"$f":"SUMIF('UIN Data'!$H:$H,H$2&$B11,'UIN Data'!$I:$I)","v":0},{"$f":"SUMIF('UIN Data'!$H:$H,I$2&$B11,'UIN Data'!$I:$I)","v":0},{"$f":"SUMIF('UIN Data'!$H:$H,J$2&$B11,'UIN Data'!$I:$I)","v":0},{"$f":"SUMIF('UIN Data'!$H:$H,K$2&$B11,'UIN Data'!$I:$I)","v":0},{"$f":"SUMIF('UIN Data'!$H:$H,L$2&$B11,'UIN Data'!$I:$I)","v":0},{"$f":"SUMIF('UIN Data'!$H:$H,M$2&$B11,'UIN Data'!$I:$I)","v":0},{"$f":"SUMIF('UIN Data'!$H:$H,N$2&$B11,'UIN Data'!$I:$I)","v":0},{"$f":"SUMIF('UIN Data'!$H:$H,O$2&$B11,'UIN Data'!$I:$I)","v":0},{"$f":"SUMIF('UIN Data'!$H:$H,P$2&$B11,'UIN Data'!$I:$I)","v":0},{"$f":"SUMIF('UIN Data'!$H:$H,Q$2&$B11,'UIN Data'!$I:$I)","v":0},{"$f":"SUMIF('UIN Data'!$H:$H,R$2&$B11,'UIN Data'!$I:$I)","v":0}]
[null,"Tab1_1PelnaDividendes",null,null,null,"Peļņas daļa, kuru sadala dividendēs taksācijas periodā",{"$f":"SUMIF('UIN Data'!$H:$H,G$2&$B12,'UIN Data'!$I:$I)","v":0},{"$f":"SUMIF('UIN Data'!$H:$H,H$2&$B12,'UIN Data'!$I:$I)","v":0},{"$f":"SUMIF('UIN Data'!$H:$H,I$2&$B12,'UIN Data'!$I:$I)","v":0},{"$f":"SUMIF('UIN Data'!$H:$H,J$2&$B12,'UIN Data'!$I:$I)","v":0},{"$f":"SUMIF('UIN Data'!$H:$H,K$2&$B12,'UIN Data'!$I:$I)","v":0},{"$f":"SUMIF('UIN Data'!$H:$H,L$2&$B12,'UIN Data'!$I:$I)","v":0},{"$f":"SUMIF('UIN Data'!$H:$H,M$2&$B12,'UIN Data'!$I:$I)","v":0},{"$f":"SUMIF('UIN Data'!$H:$H,N$2&$B12,'UIN Data'!$I:$I)","v":0},{"$f":"SUMIF('UIN Data'!$H:$H,O$2&$B12,'UIN Data'!$I:$I)","v":0},{"$f":"SUMIF('UIN Data'!$H:$H,P$2&$B12,'UIN Data'!$I:$I)","v":0},{"$f":"SUMIF('UIN Data'!$H:$H,Q$2&$B12,'UIN Data'!$I:$I)","v":0},{"$f":"SUMIF('UIN Data'!$H:$H,R$2&$B12,'UIN Data'!$I:$I)","v":0}]
[null,"Tab1_1Paradi",null,null,null,"Debitoru parādi, kuri samazinājuši ar nodokli apliekamo bāzi",{"$f":"SUMIF('UIN Data'!$H:$H,G$2&$B13,'UIN Data'!$I:$I)","v":0},{"$f":"SUMIF('UIN Data'!$H:$H,H$2&$B13,'UIN Data'!$I:$I)","v":0},{"$f":"SUMIF('UIN Data'!$H:$H,I$2&$B13,'UIN Data'!$I:$I)","v":0},{"$f":"SUMIF('UIN Data'!$H:$H,J$2&$B13,'UIN Data'!$I:$I)","v":0},{"$f":"SUMIF('UIN Data'!$H:$H,K$2&$B13,'UIN Data'!$I:$I)","v":0},{"$f":"SUMIF('UIN Data'!$H:$H,L$2&$B13,'UIN Data'!$I:$I)","v":0},{"$f":"SUMIF('UIN Data'!$H:$H,M$2&$B13,'UIN Data'!$I:$I)","v":0},{"$f":"SUMIF('UIN Data'!$H:$H,N$2&$B13,'UIN Data'!$I:$I)","v":0},{"$f":"SUMIF('UIN Data'!$H:$H,O$2&$B13,'UIN Data'!$I:$I)","v":0},{"$f":"SUMIF('UIN Data'!$H:$H,P$2&$B13,'UIN Data'!$I:$I)","v":0},{"$f":"SUMIF('UIN Data'!$H:$H,Q$2&$B13,'UIN Data'!$I:$I)","v":0},{"$f":"SUMIF('UIN Data'!$H:$H,R$2&$B13,'UIN Data'!$I:$I)","v":0}]
[null,"Tab1_1Aizdevums",null,null,null,"Aizdevums, kuram piemērots pārejas noteikumu 34.punkts",{"$f":"SUMIF('UIN Data'!$H:$H,G$2&$B14,'UIN Data'!$I:$I)","v":0},{"$f":"SUMIF('UIN Data'!$H:$H,H$2&$B14,'UIN Data'!$I:$I)","v":0},{"$f":"SUMIF('UIN Data'!$H:$H,I$2&$B14,'UIN Data'!$I:$I)","v":0},{"$f":"SUMIF('UIN Data'!$H:$H,J$2&$B14,'UIN Data'!$I:$I)","v":0},{"$f":"SUMIF('UIN Data'!$H:$H,K$2&$B14,'UIN Data'!$I:$I)","v":0},{"$f":"SUMIF('UIN Data'!$H:$H,L$2&$B14,'UIN Data'!$I:$I)","v":0},{"$f":"SUMIF('UIN Data'!$H:$H,M$2&$B14,'UIN Data'!$I:$I)","v":0},{"$f":"SUMIF('UIN Data'!$H:$H,N$2&$B14,'UIN Data'!$I:$I)","v":0},{"$f":"SUMIF('UIN Data'!$H:$H,O$2&$B14,'UIN Data'!$I:$I)","v":0},{"$f":"SUMIF('UIN Data'!$H:$H,P$2&$B14,'UIN Data'!$I:$I)","v":0},{"$f":"SUMIF('UIN Data'!$H:$H,Q$2&$B14,'UIN Data'!$I:$I)","v":0},{"$f":"SUMIF('UIN Data'!$H:$H,R$2&$B14,'UIN Data'!$I:$I)","v":0}]
[null,null,null,null,null,"Peļņas daļa, kuru sadalīs turpmākajos periodos",{"$f":"IF(G9+G11-SUM(G10,G12:G14)>0,G9+G11-SUM(G10,G12:G14),0)","v":0},0,0,0,0,0,{"$f":"IF(M9+M11-SUM(M10,M12:M14)>0,M9+M11-SUM(M10,M12:M14),0)","v":0},0,0,0,0,0]
[]
[null,null,null,null,"1.2. Pirmstaksācijas periodu zaudējumi, kuri radušies līdz 2017.gada 31.decembrim un kuri aprēķināti UIN vajadzībām saskaņā ar likuma “Par UIN” 14.pantu un nav pārnesti \n         nodokļa vajadzībām"]
[null,"Tab1_2Zaudejumi",null,null,null,"Zaudējumu summa, kuru var segt no nākamo piecu pārskata gadu nodokļa bāzes",{"$f":"SUMIF('UIN Data'!$H:$H,G$2&$B18,'UIN Data'!$I:$I)","v":0},{"$f":"SUMIF('UIN Data'!$H:$H,H$2&$B18,'UIN Data'!$I:$I)","v":0},{"$f":"SUMIF('UIN Data'!$H:$H,I$2&$B18,'UIN Data'!$I:$I)","v":0},{"$f":"SUMIF('UIN Data'!$H:$H,J$2&$B18,'UIN Data'!$I:$I)","v":0},{"$f":"SUMIF('UIN Data'!$H:$H,K$2&$B18,'UIN Data'!$I:$I)","v":0},{"$f":"SUMIF('UIN Data'!$H:$H,L$2&$B18,'UIN Data'!$I:$I)","v":0},{"$f":"SUMIF('UIN Data'!$H:$H,M$2&$B18,'UIN Data'!$I:$I)","v":0},{"$f":"SUMIF('UIN Data'!$H:$H,N$2&$B18,'UIN Data'!$I:$I)","v":0},{"$f":"SUMIF('UIN Data'!$H:$H,O$2&$B18,'UIN Data'!$I:$I)","v":0},{"$f":"SUMIF('UIN Data'!$H:$H,P$2&$B18,'UIN Data'!$I:$I)","v":0},{"$f":"SUMIF('UIN Data'!$H:$H,Q$2&$B18,'UIN Data'!$I:$I)","v":0},{"$f":"SUMIF('UIN Data'!$H:$H,R$2&$B18,'UIN Data'!$I:$I)","v":0}]
[null,null,null,null,null,"Pārskata gads, kurā pārnes zaudējumus",{"$f":"LEFT(G2,4)","v":"1900"},{"$f":"LEFT(H2,4)","v":"1900"},"1900","1900","1900","1900","1900","1900","1900","1900","1900","1900"]
[null,"Tab1_2Samazinats",null,null,null,"Zaudējumu summa, kura samazina nodokļa bāzi pārskata gadā",{"$f":"SUMIF('UIN Data'!$H:$H,G$2&$B20,'UIN Data'!$I:$I)","v":0},{"$f":"SUMIF('UIN Data'!$H:$H,H$2&$B20,'UIN Data'!$I:$I)","v":0},{"$f":"SUMIF('UIN Data'!$H:$H,I$2&$B20,'UIN Data'!$I:$I)","v":0},{"$f":"SUMIF('UIN Data'!$H:$H,J$2&$B20,'UIN Data'!$I:$I)","v":0},{"$f":"SUMIF('UIN Data'!$H:$H,K$2&$B20,'UIN Data'!$I:$I)","v":0},{"$f":"SUMIF('UIN Data'!$H:$H,L$2&$B20,'UIN Data'!$I:$I)","v":0},{"$f":"SUMIF('UIN Data'!$H:$H,M$2&$B20,'UIN Data'!$I:$I)","v":0},{"$f":"SUMIF('UIN Data'!$H:$H,N$2&$B20,'UIN Data'!$I:$I)","v":0},{"$f":"SUMIF('UIN Data'!$H:$H,O$2&$B20,'UIN Data'!$I:$I)","v":0},{"$f":"SUMIF('UIN Data'!$H:$H,P$2&$B20,'UIN Data'!$I:$I)","v":0},{"$f":"SUMIF('UIN Data'!$H:$H,Q$2&$B20,'UIN Data'!$I:$I)","v":0},{"$f":"SUMIF('UIN Data'!$H:$H,R$2&$B20,'UIN Data'!$I:$I)","v":0}]
{"$rows_left_out":141}
{"sheet":"2","index":4,"n_rows":5,"n_cols":12,"rows_kept":5,"cut":false,"hidden":false,"merged":[[1,1,4,1],[1,9,4,9],[1,10,4,10],[1,2,3,3],[1,11,4,11],[1,4,4,4],[1,5,4,5],[1,6,4,6],[1,7,4,7],[1,8,4,8]]}
[]
[null,"Npk.","Taksācijas periods, kurā saņemtas dividendes",null,"Dividenžu izmaksātāja rezidences valsts","Dividenžu izmaksātāja reģistrācijas numurs","Dividenžu izmaksātāja nosaukums","Saņemto dividenžu summa","Samazinājuma summa par pirmstaksācijas periodos izmaksātajām dividendēm","Dividendes, par kurām samazināta nodokļa bāze taksācijas periodā","Dividendes, kuras attiecināmas uz nākamajiem taksācijas periodiem","Periods"]
[]
[]
[null,null,"No","Līdz"]

{"sheet":"5.1","index":5,"n_rows":4,"n_cols":8,"rows_kept":4,"cut":false,"hidden":false,"merged":[[1,1,3,1],[1,4,3,4],[1,5,3,5],[1,6,3,6],[1,7,3,7],[1,2,2,3]]}
[]
[null,"Npk.","Taksācijas periods, kurā saņemtas dividendes",null,"Pamatkapitāla palielinājuma summa","Pamatkapitāla palielinājuma summa no nesadalītās peļņas","Pamatkapitāla samazinājuma summa taksācijas periodā, kuru iekļauj ar nodokli apliekamajā bāzē","Periods"]
[]
[null,null,"No","Līdz"]

{"sheet":"6.2","index":6,"n_rows":4,"n_cols":7,"rows_kept":4,"cut":false,"hidden":false,"merged":[[1,4,3,4],[1,5,3,5],[1,6,3,6],[1,2,2,3],[1,1,3,1]]}
[]
[null,"Npk.","Taksācijas periods, kurā izveidoti uzkrājumi debitoru parādiem",null,"Uzkrājumu debitoru parādiem turēšanas periods (mēnešos)","Nodokļa bāzē iekļautā debitoru parādu summa pārskatā gadā","Periods"]
[]
[null,null,"No","Līdz"]

{"sheet":"8","index":7,"n_rows":4,"n_cols":9,"rows_kept":4,"cut":false,"hidden":false,"merged":[[1,8,3,8],[1,2,2,3],[1,1,3,1],[1,4,3,4],[1,5,3,5],[1,6,3,6],[1,7,3,7]]}
[]
[null,"Npk.","Taksācijas periods, kurā gūts ienākums un samaksāts nodoklis ārvalstī",null,"Valsts, kurā nodoklis samaksāts","Nodokļa summa, kura samaksāta ārvalstī (euro)","Nodokļa summa, kura samazina taksācijas perioda nodokli","Nodokļa summa, kuru pārnes uz nākamajiem taksācijas periodiem","Periods"]
[]
[null,null,"No","Līdz"]

{"sheet":"9.1.1","index":8,"n_rows":2,"n_cols":8,"rows_kept":2,"cut":false,"hidden":false,"merged":[[1,1,3,1],[1,7,3,7],[1,6,3,6],[1,5,3,5],[1,4,3,4],[1,3,3,3],[1,2,3,2]]}
[]
[null,"Npk.","Ziedojuma saņēmēja nodokļa maksātāja reģistrācijas kods","Ziedojumu saņēmēja nosaukums","Rezidences valsts","Ziedojuma veikšanas datums","Ziedojuma summa (EUR)","Periods"]

{"sheet":"15","index":9,"n_rows":2,"n_cols":10,"rows_kept":2,"cut":false,"hidden":false,"merged":[[1,7,5,7],[1,8,5,8],[1,9,5,9],[1,2,5,2],[1,1,5,1],[1,3,5,3],[1,4,5,4],[1,5,5,5],[1,6,5,6]]}
[]
[null,"Npk.","Akciju iegādes datums","Akciju atsavināšanas datums","Akciju turēšanas periods (mēnešos)","Akciju iegādes vērtība","Akciju atsavināšanas vērtība","Ienākums no akciju atsavināšanas, par kuru samazina nodokļa bāzi taksācijas periodā","Ienākums no akciju atsavināšanas, kas attiecināms uz turpmākajiem taksācijas periodiem","Periods"]

{"sheet":"31.2","index":10,"n_rows":6,"n_cols":9,"rows_kept":6,"cut":false,"hidden":false,"merged":[[1,1,5,1],[1,2,4,3],[1,8,5,8],[1,7,5,7],[1,6,5,6],[1,5,5,5],[1,4,5,4]]}
[]
[null,"Npk.","Taksācijas periods, kurā aizdevuma summa vai debitora parāda summa, iekļauta nodokļa bāzē",null,"Aizdevuma summa vai debitora parāda summa","Nodokļa summa, kas faktiski samaksāta par attiecīgo summu taksācijas periodā, kurā tā iekļauta nodokļa bāzē","Atmaksātā aizdevuma summa vai atgūtā debitora parāda summa","Nodokļa pārmaksa, ja taksācijas periodā ir atgūta attiecīgā aizdevuma vai debitora parāda summa","Periods"]
[]
[]
[]
[null,null,"No","Līdz"]

{"sheet":"Tiesibas","index":11,"n_rows":18,"n_cols":15,"rows_kept":18,"cut":false,"hidden":true,"merged":[]}
[]
[null,null,null,"DatumsNo","2025-09-09",null,null,"TisWbName","ThisWbCustId","RN","ActivationDate","CompName/Path","Processor/HddSerialId","PROCESSOR_REVISION","USERNAME"]
[null,null,null,"DatumsLidz","2025-09-20",null,null,"UIN",1,25,"2020-09-09","-","-","-","-"]
[null,null,null,"Skaitītājs (demo versijai)"]
[]
[null,null,null,"ThisWbName","UIN"]
[null,null,null,"ThisWbCustId",1]
[null,null,null,"Limenis","D"]
[]
[null,null,null,"Nesakonfigurētas tiesības!"]
[null,null,null,"Nesakonfigurētas tiesības versijai!"]
[null,null,null,"Versijas periods ir beidzies!"]
[null,null,null,"Versijas apstrādes uzņēmuma RegNr neatbilst definētam!"]
[null,null,null,"Izvelētais RegNr nav definēts šajā versijā!"]
[null,null,null,"Lūdzu aizpildiet reģistrācijas numuru!"]
[null,null,null,"Versijas Importa/Eksporta skaits sasniedza 20!"]
[null,null,null,"Lūdzu veikt faila aktivāciju uz lapas \"Instrukcija\"!"]
[null,null,null,"Fails jau ir aktivizēts šim datoram un lietotājam!"]

{"sheet":"Symbols","index":12,"n_rows":5,"n_cols":2,"rows_kept":5,"cut":false,"hidden":true,"merged":[]}
["FromEDS","ToXLM"]
["D+","i"]
["D ","u"]
["E ","n"]
["D<","l"]