{"text_format":"1","workbook":"xlsx","n_sheets":23,"sheets":["Pamatdati","Pamatinformācija","Aktīvi","Pasīvi","PZA1","PZA2","NPP1","NPP2","PKIP","Ziedotāji un dāvinātāji","Paraugs","Pielikums vai piezīmes","Šabloni pielikumiem","Revidents","Instrukcija","<-eds-uzņ->","Klasifikācija","VgDati","TabSchema","Saraksti","Tiesibas","Format","VgKlas"],"not_rendered":{"charts":0,"images":1,"macros":1,"external_links":0,"defined_names":54,"comments":3,"pivot_tables":0},"unopened":[],"bounds":{"document_bytes":16777216,"sheet_cells":100000,"rows_first":2000,"rows_last":500,"rows_between":2000,"halvings":0,"cell_chars":16384,"cell_head_chars":4096},"cells_cut":0,"cells_raw":0,"read":"whole","date_system":"1900"}

{"sheet":"Pamatdati","index":0,"n_rows":38,"n_cols":19,"rows_kept":38,"cut":false,"hidden":false,"merged":[[32,5,32,6],[32,7,32,8],[2,7,2,8],[13,10,13,12],[12,10,12,12],[19,6,19,7],[21,10,21,12],[4,5,4,6],[5,5,5,6],[6,5,6,6],[7,5,7,6],[10,10,10,12],[7,10,8,11],[7,12,8,12],[37,5,37,7],[8,5,8,6],[17,6,17,8],[14,6,14,8],[16,6,16,7],[15,6,15,7],[34,5,34,7],[36,5,36,7],[30,5,30,6],[18,6,18,7],[12,6,12,7],[13,6,13,8],[35,5,35,7],[30,7,30,8],[31,5,31,6],[31,7,31,8],[7,14,7,15],[7,16,7,17],[8,14,8,15],[12,15,12,17],[13,15,13,17],[4,14,4,15],[4,16,4,17],[5,14,5,15],[5,16,5,17],[6,14,6,15],[6,16,6,17],[37,14,37,16],[23,10,24,12],[35,14,35,16],[30,14,30,15],[30,16,30,17],[31,14,31,15],[31,16,31,17],[32,14,32,15],[32,16,32,17],[18,15,18,17],[19,15,19,17],[8,16,8,17],[34,14,34,16],[36,14,36,16],[17,15,17,17],[14,15,14,17],[15,15,15,16],[16,15,16,16]]}
[{"$f":"COLUMN(O1)-COLUMN(F1)","v":9},"xmlIdent","xmlClmn"]
[]
[null,"GpTips",{"$f":"COLUMN(F3)","v":6},null,null,"Pamatdati",null,"Biedrības, nodibinājuma un arodbiedrības gada pārskats",null,null,"$D$1:$J$33",null,null,null,"Tikai salīdzināšanai"]
[]
[null,"NmrKods",{"$f":"COLUMN(H5)","v":8},null,null,"Reģistrācijas numurs*",null,null,null,null,"Decimālais atdalītais",null,{"$f":"MID(1/10,2,1)","v":"."},null,"Reģistrācijas numurs "]
[null,"TaxPayerName",{"$f":"COLUMN(H6)","v":8},null,null,"Nosaukums ",null,null,null,null,"Tūkstošu atdalītais",null,null,null,"Nosaukums "]
[null,"AddressForResponse",{"$f":"COLUMN(H7)","v":8},null,null,"Adrese ",null,null,null,null,null,null,null,null,"Adrese "]
[null,"TaksNo",{"$f":"COLUMN(H8)","v":8},null,null,"Taksācijas periods  no*",null,null,null,null,"EDS GP lapas \ngari nosaukumi",null,"Jā",null,"Taksācijas periods  no "]
[null,"TaksLidz",{"$f":"COLUMN(H9)","v":8},null,null,"Taksācijas periods  līdz*",null,null,null,null,null,null,null,null,"Taksācijas periods  līdz "]
[]
[null,null,null,null,null,"Iesniedzamā informācija",null,null,"Papildus parametri"]
[]
[null,"IrPamatInformacija",{"$f":"COLUMN(F13)","v":6},null,null,null," Pamatinformācija",null,null,null,"Datu pūslmas virziens",null,null,null,"x"," Pamatinformācija"]
[null,"IrAktivi",6,null,null,null," Bilances aktīvi",null,null,null,"2. uz EDS XML no šī rīka",null,null,null,"x"," Bilances aktīvi"]
[null,"IrPasivi",6,null,null,null," Bilances pasīvi",null,null,null,null,null,null,null,"x"," Bilances pasīvi"]
[null,"PZAType,NPPType",{"$f":"COLUMN(F16)","v":6},null,null,null," Peļņas vai zaudējumu aprēķins",null,null,null,null,null,null,null,"x"," Peļņas vai zaudējumu aprēķins"]
[null,"IrSadalaNaudasPlusmasParskats",{"$f":"COLUMN(F17)","v":6},null,null,null," Naudas plūsmas pārskats",null,null,null,null,null,null,null,null," Naudas plūsmas pārskats"]
[null,"IrSadalaKapitalaRezervjuIzmainuParskats",{"$f":"COLUMN(F18)","v":6},null,null,null," Pašu kapitāla izmaiņu pārskats",null,null,null,null,null,null,null,null," Pašu kapitāla izmaiņu pārskats"]
[null,"IrSadalaPielikums",{"$f":"COLUMN(F19)","v":6},null,null,null," Fin. Pārsk. pielikums vai piezīmes",null,null,null,null,null,null,null,null," Finanšu pārskata pielikums vai piezīmes"]
[null,"IrSadalaRevidents",{"$f":"COLUMN(F20)","v":6},null,null,null," Informācija par revidentu",null,null,null,null,null,null,null,null," Informācija par revidentu"]
[]
[null,null,null,null,null,"Finanšu pārskata pielikums vai piezīmes"]
[]
[null,"Piezimes",{"$f":"COLUMN(F24)","v":6},null,null,null,"Mikro Mikro","Attēlot tikai piezīmes",null,null,null,null,null,null,null,"Mikro","Attēlot tikai piezīmes"]
[null,"Saisinats",6,null,null,null,"Mikro","Attēlot saīsināto finanšu pārskata pielikumu",null,null,null,null,null,null,null,"Mazie","Attēlot saīsināto finanšu pārskata pielikumu"]
[null,null,6,null,null,null,"Mazie","Ja nekas nav atzīmēts",null,null,null,null,null,null,null,"Videjie","Ja nekas nav atzimēts"]
[null,"RaditVisu",6,null,null,null,"Vidējie","Rādīt visus laukus",null,null,null,null,null,null,null,"Lielie","Rādīt visus laukus"]
[]
[null,null,null,null,null,"Sagatavotājs"]
[]
[null,"Sagatavotajs",{"$f":"COLUMN(H31)","v":8},null,null,"Vārds, uzvārds ",null,null,null,null,null,null,null,null,"Vārds, uzvārds "]
[null,"Epasts",8,null,null,"E-pasts* ",null,null,null,null,null,null,null,null,"E-pasts* "]
[null,"Talrunis",8,null,null,"Tālrunis ",null,null,null,null,null,null,null,null,"Tālrunis "]
[]
[null,"Id",{"$f":"COLUMN(I35)","v":9},null,null,"EDS Dokumenta numurs  ",null,null,null,null,null,null,null,null,"EDS Dokumenta numurs  "]
[null,"UID",{"$f":"COLUMN(I36)","v":9},null,null,"UID",null,null,null," ",null,null,null,null,"UID",null,null,null," "]
[null,"Signer",{"$f":"COLUMN(I37)","v":9},null,null,"Parakstītajs ",null,null,null,null,null,null,null,null,"Parakstītajs "]
[null,"Timestamp",9,null,null,"Datums un laiks ",null,null,null,null,null,null,null,null,"Datums un laiks "]

{"sheet":"Pamatinformācija","index":1,"n_rows":32,"n_cols":27,"rows_kept":32,"cut":false,"hidden":true,"merged":[[5,22,6,22],[23,15,23,17],[24,15,24,17],[5,8,6,20],[8,15,8,17],[16,15,16,17],[25,15,25,17],[26,15,26,17],[28,15,28,17],[29,15,29,17],[20,15,20,20],[22,15,22,17],[5,25,6,37],[8,32,8,34],[16,32,16,34],[26,32,26,34],[28,32,28,34],[29,32,29,34],[20,32,20,37],[22,32,22,34],[23,32,23,34],[24,32,24,34],[25,32,25,34]]}
[{"$f":"COLUMN(Y1)-COLUMN(H1)","v":17},"xlGr","xmlIdent","xmlClmn","width"]
[]
[null,null,null,null,null,null,null,"Pamatinformācija",null,null,null,null,null,null,null,null,null,null,null,null,null,null,{"$f":"IF(Pamatdati!$H$5=Pamatdati!$Q$5,IF(Pamatdati!$H$8-1=Pamatdati!$Q$9,\"IPG\",\"PG\"),\"N\")","v":"PG"},null,"Tikai salīdzināšanai"]
[null,{"$f":"B5","v":"G"}]
[null,{"$f":"B6","v":"G"},null,null,null,null,null,null,"Pamatojums saīsināta pārskata perioda iesniegšanai",null,null,null,null,null,null,null,null,null,null,null,null,null,null,null,null,"Pamatojums saīsināta pārskata perioda iesniegšanai"]
[null,{"$f":"IF(OR(I6<>\"\",Z6<>\"\"),\"\",\"G\")","v":"G"},"Pamatojums",{"$f":"COLUMN(I6)","v":9},{"$f":"CLEAN(LEFT(I6,LEN(I6)/2))","v":""}]
[null,{"$f":"B6","v":"G"},null,null,{"$f":"CLEAN(RIGHT(I6,LEN(I6)/2))","v":""}]
[]
[null,null,"Darbinieki",{"$f":"COLUMN(P9)","v":16},null,null,null,5,"Vidējais darbinieku skaits*",null,null,null,null,null,null,null,null,null,null,null,null,null,null,null,5,"Vidējais darbinieku skaits*"]
[null,{"$f":"B11","v":"G"}]
[null,{"$f":"IF(OR(I11<>\"\",Z11<>\"\"),\"\",\"G\")","v":"G"},"SlegBilance",{"$f":"COLUMN(I11)","v":9},null,null,null,7,null,"Likvidācijas slēguma bilance",null,null,null,null,null,null,null,null,null,null,null,null,null,null,7,null,"Likvidācijas slēguma bilance"]
[null,{"$f":"B13","v":"G"}]
[null,{"$f":"IF(OR(I13<>\"\",Z13<>\"\"),\"\",\"G\")","v":"G"},"SaimnParskats",{"$f":"COLUMN(I13)","v":9},null,null,null,9,null,"Saimnieciskās darbības pārskats (iesniedz tikai tad, ja uzņēmums uz laiku pārtrauc saimniecisko darbību)",null,null,null,null,null,null,null,null,null,null,null,null,null,null,9,null,"Saimnieciskās darbības pārskats (iesniedz tikai tad, ja uzņēmums uz laiku pārtrauc saimniecisko darbību)"]
[null,{"$f":"IF(OR(I14<>\"\",Z14<>\"\"),\"\",\"G\")","v":"G"},"NavSamazinasana",{"$f":"COLUMN(I14)","v":9},null,null,null,null,null,"Reorganizācijas, darbības izbeigšanas (likvidācijas) vai apturēšanas rezultātā nav notikusi aktīvu vērtības samazināšanās",null,null,null,null,null,null,null,null,null,null,null,null,null,null,null,null,"Reorganizācijas, darbības izbeigšanas (likvidācijas) vai apturēšanas rezultātā nav notikusi aktīvu vērtības samazināšanās"]
[null,{"$f":"B16","v":"G"}]
[null,{"$f":"IF(OR(I16<>\"\",Z16<>\"\"),\"\",\"G\")","v":"G"},"StarptStandarti",{"$f":"COLUMN(I16)","v":9},null,null,null,10,null,"Sagatavots atbilstoši starptautiskajiem grāmatvedības standartiem",null,null,null,null,null,null,null,null,null,null,null,null,null,null,10,null,"Sagatavots atbilstoši starptautiskajiem grāmatvedības standartiem"]
[null,{"$f":"B16","v":"G"},"NoapalosanasPakape",{"$f":"COLUMN(P17)","v":16},null,null,null,null,null,"Noapaļošanas pakāpe gada pārskata summās",null,null,null,null,null,null,null,null,null,null,null,null,null,null,null,null,"Noapaļošanas pakāpe gada pārskata summās"]
[null,{"$f":"B19","v":"G"}]
[null,{"$f":"IF(OR(I19<>\"\",Z19<>\"\"),\"\",\"G\")","v":"G"},"AtsevStarptStandarti",{"$f":"COLUMN(I19)","v":9},null,null,null,11,null,"Atsevišķi posteņi (arī iepriekšējā pārskata gada posteņi) sagatavoti atbilstoši starptautiskajiem grāmatvedības standartiem",null,null,null,null,null,null,null,null,null,null,null,null,null,null,11,null,"Atsevišķi posteņi (arī iepriekšējā pārskata gada posteņi) sagatavoti atbilstoši starptautiskajiem grāmatvedības standartiem"]
[]
[null,null,"UznemVeids",{"$f":"COLUMN(P21)","v":16},null,null,null,12,"Uzņēmējdarbības forma",null,null,null,null,null,null,null,null,null,null,null,null,null,null,null,12,"Uzņēmējdarbības forma"]
[]
[null,null,"GramVeids",{"$f":"COLUMN(P23)","v":16},null,null,null,13,"Persona, kura kārto grāmatvedības uzskaiti*",null,null,null,null,null,null,null,null,null,null,null,null,null,null,null,13,"Persona, kura kārto grāmatvedības uzskaiti*"]
[null,{"$f":"IF(OR(P24<>\"\",AG24<>\"\"),\"\",\"G\")","v":"G"},"GramNmrKods",{"$f":"COLUMN(P24)","v":16},null,null,null,null,"Grāmatvedības pakalpojumu sniedzēja sabiedrības reģistrācijas numurs",null,null,null,null,null,null,null,null,null,null,null,null,null,null,null,null,"Grāmatvedības pakalpojumu sniedzēja sabiedrības reģistrācijas numurs"]
[null,{"$f":"B24","v":"G"},"GramNosaukums",{"$f":"COLUMN(P25)","v":16},null,null,null,null,"Grāmatvedības pakalpojumu sniedzēja sabiedrības nosaukums",null,null,null,null,null,null,null,null,null,null,null,null,null,null,null,null,"Grāmatvedības pakalpojumu sniedzēja sabiedrības nosaukums"]
[null,null,"GramVardsUzvards",{"$f":"COLUMN(P26)","v":16},null,null,null,null,"Personas vārds, uzvārds",null,null,null,null,null,null,null,null,null,null,null,null,null,null,null,null,"Personas vārds, uzvārds"]
[null,null,"GramAmats",{"$f":"COLUMN(P27)","v":16},null,null,null,null,"Personas amats*",null,null,null,null,null,null,null,null,null,null,null,null,null,null,null,null,"Personas amats*"]
[]
[null,null,"DatumsPub",{"$f":"COLUMN(P29)","v":16},null,null,null,14,"Gada pārskata apstiprināšanas datums*",null,null,null,null,null,null,null,null,null,null,null,null,null,null,null,14,"Gada pārskata apstiprināšanas datums*"]
[null,null,"AizpAmats",{"$f":"COLUMN(P30)","v":16},null,null,null,null,"Amatpersonas amats",null,null,null,null,null,null,null,null,null,null,null,null,null,null,null,null,"Amatpersonas amats"]
[null,{"$f":"B32","v":"G"}]
[null,{"$f":"IF(OR(I32<>\"\",Z32<>\"\"),\"\",\"G\")","v":"G"},"MeitasSabiedriba",{"$f":"COLUMN(I32)","v":9},null,null,null,15,null,"Publiskas sabiedrības meitas sabiedrība",null,null,null,null,null,null,null,null,null,null,null,null,null,null,15,null,"Publiskas sabiedrības meitas sabiedrība"]

{"sheet":"Aktīvi","index":2,"n_rows":80,"n_cols":21,"rows_kept":80,"cut":false,"hidden":true,"merged":[]}
[{"$f":"COLUMN(P1)-COLUMN(G1)","v":9},"xmlIdent","xmlClmn","xlGr"]
[]
[null,null,null,null,null,null,"Bilances aktīvi",null,null,null,null,null,null,{"$f":"IF(Pamatdati!$H$5=Pamatdati!$Q$5,IF(Pamatdati!$H$8-1=Pamatdati!$Q$9,\"IPG\",\"PG\"),\"N\")","v":"PG"},null,"Tikai salīdzināšanai"]
[]
[null,null,null,null,null,null,"Posteņa nosaukums",null,null,"Rindas kods","Pārskata\ngada beigās","Iepriekšējā\npārskata\ngada beigās",null,null,null,"Posteņa nosaukums",null,null,"Rindas kods","Pārskata\ngada beigās","Iepriekšējā\npārskata\ngada beigās"]
[null,null,null,null,null,null,"Ilgtermiņa ieguldījumi",null,null,"10",null,null,null,null,null,"Ilgtermiņa ieguldījumi",null,null,"10"]
[null,null,null,null,null,null,null,"I. Nemateriālie ieguldījumi:",null,"20",null,null,null,null,null,null,"I. Nemateriālie ieguldījumi:",null,"20"]
[null,"R30",{"$f":"COLUMN(K8)","v":11},{"$f":"IF(AND(OR(K8=\"\",K8=0),OR(L8=\"\",L8=0),OR(T8=\"\",T8=0),OR(U8=\"\",U8=0)),\"G\",\"\")","v":"G"},null,null,null,"1. Attīstības izmaksas.",null,"30",null,null,null,null,null,null,"1. Attīstības izmaksas.",null,"30"]
[null,"R40",{"$f":"COLUMN(K9)","v":11},{"$f":"IF(AND(OR(K9=\"\",K9=0),OR(L9=\"\",L9=0),OR(T9=\"\",T9=0),OR(U9=\"\",U9=0)),\"G\",\"\")","v":"G"},null,null,null,"2. Koncesijas, patenti, licences, preču zīmes un tamlīdzīgas tiesības.",null,"40",null,null,null,null,null,null,"2. Koncesijas, patenti, licences, preču zīmes un tamlīdzīgas tiesības.",null,"40"]
[null,"R50",11,{"$f":"IF(AND(OR(K10=\"\",K10=0),OR(L10=\"\",L10=0),OR(T10=\"\",T10=0),OR(U10=\"\",U10=0)),\"G\",\"\")","v":"G"},null,null,null,"3. Citi nemateriālie ieguldījumi.",null,"50",null,null,null,null,null,null,"3. Citi nemateriālie ieguldījumi.",null,"50"]
[null,"R60",11,"G",null,null,null,"4. Nemateriālā vērtība.",null,"60",null,null,null,null,null,null,"4. Nemateriālā vērtība.",null,"60"]
[null,"R70",11,"G",null,null,null,"5. Avansa maksājumi par nemateriāliem ieguldījumiem.",null,"70",null,null,null,null,null,null,"5. Avansa maksājumi par nemateriāliem ieguldījumiem.",null,"70"]
[null,null,null,"S",null,null,null,"I. Nemateriālie ieguldījumi kopā",null,"80",{"$f":"SUM(K8:K12)","v":0},{"$f":"SUM(L8:L12)","v":0},null,null,null,null,"I. Nemateriālie ieguldījumi kopā",null,"80",{"$f":"SUM(T8:T12)","v":0},{"$f":"SUM(U8:U12)","v":0}]
[null,null,null,null,null,null,null,null,null,"",null,null,null,null,null,null,null,null,""]
[null,null,null,null,null,null,null,"II. Pamatlīdzekļi:",null,"90",null,null,null,null,null,null,"II. Pamatlīdzekļi:",null,"90"]
[null,null,null,{"$f":"IF(AND(OR(K16=\"\",K16=0),OR(L16=\"\",L16=0),OR(T16=\"\",T16=0),OR(U16=\"\",U16=0)),\"G\",\"\")","v":"G"},null,null,null,"1. Nekustamie īpašumi:",null,"100",{"$f":"SUM(K17:K18)","v":0},{"$f":"SUM(L17:L18)","v":0},null,null,null,null,"1. Nekustamie īpašumi:",null,"100",{"$f":"SUM(T17:T18)","v":0},{"$f":"SUM(U17:U18)","v":0}]
[null,"R110",{"$f":"COLUMN(K17)","v":11},"G",null,null,null,"   a) zemesgabali, ēkas un inženierbūves",null,"110",null,null,null,null,null,null,"   a) zemesgabali, ēkas un inženierbūves",null,"110"]
[null,"R120",11,"G",null,null,null,"   b) ieguldījuma īpašumi",null,120,null,null,null,null,null,null,"   b) ieguldījuma īpašumi",null,120]
[null,null,null,"G",null,null,null,"2. Dzīvnieki un augi:",null,"130",{"$f":"SUM(K20:K21)","v":0},{"$f":"SUM(L20:L21)","v":0},null,null,null,null,"2. Dzīvnieki un augi:",null,"130",{"$f":"SUM(T20:T21)","v":0},{"$f":"SUM(U20:U21)","v":0}]
[null,"R140",{"$f":"COLUMN(K20)","v":11},"G",null,null,null,"   a) darba vai produktīvie dzīvnieki un ilggadīgie stādījumi",null,"140",null,null,null,null,null,null,"   a) darba vai produktīvie dzīvnieki un ilggadīgie stādījumi",null,"140"]
[null,"R150",11,"G",null,null,null,"   b) bioloģiskie aktīvi",null,150,null,null,null,null,null,null,"   b) bioloģiskie aktīvi",null,150]
[null,"R160",11,"G",null,null,null,"3. Ilgtermiņa ieguldījumi nomātajos pamatlīdzekļos.",null,"160",null,null,null,null,null,null,"3. Ilgtermiņa ieguldījumi nomātajos pamatlīdzekļos.",null,"160"]
[null,"R170",11,"G",null,null,null,"4. Ilgtermiņa ieguldījumi publiskā partnera pamatlīdzekļos",null,"170",null,null,null,null,null,null,"4. Ilgtermiņa ieguldījumi publiskā partnera pamatlīdzekļos",null,"170"]
[null,"R180",11,"G",null,null,null,"5. Tehnoloģiskās iekārtas un ierīces.",null,"180",null,null,null,null,null,null,"5. Tehnoloģiskās iekārtas un ierīces.",null,"180"]
[null,"R190",11,"G",null,null,null,"6. Pārējie pamatlīdzekļi un inventārs.",null,"190",null,null,null,null,null,null,"6. Pārējie pamatlīdzekļi un inventārs.",null,"190"]
[null,"R200",11,"G",null,null,null,"7. Pamatlīdzekļu izveidošana un nepabeigto celtniecības objektu izmaksas.",null,"200",null,null,null,null,null,null,"7. Pamatlīdzekļu izveidošana un nepabeigto celtniecības objektu izmaksas.",null,"200"]
[null,"R210",11,"G",null,null,null,"8. Avansa maksājumi par pamatlīdzekļiem.",null,"210",null,null,null,null,null,null,"8. Avansa maksājumi par pamatlīdzekļiem.",null,"210"]
[null,null,null,"S",null,null,null,"II. Pamatlīdzekļi kopā",null,"220",{"$f":"SUM(K16,K19,K22:K27)","v":0},{"$f":"SUM(L16,L19,L22:L27)","v":0},null,null,null,null,"II. Pamatlīdzekļi kopā",null,"220",{"$f":"SUM(T16,T19,T22:T27)","v":0},{"$f":"SUM(U16,U19,U22:U27)","v":0}]
[null,null,null,"S",null,null,null,null,null,"",null,null,null,null,null,null,null,null,""]
[null,null,null,"S",null,null,null,"III. Ilgtermiņa finanšu ieguldījumi:",null,"230",null,null,null,null,null,null,"III. Ilgtermiņa finanšu ieguldījumi:",null,"230"]
[null,"R240",{"$f":"COLUMN(K31)","v":11},{"$f":"IF(AND(OR(K31=\"\",K31=0),OR(L31=\"\",L31=0),OR(T31=\"\",T31=0),OR(U31=\"\",U31=0)),\"G\",\"\")","v":"G"},null,null,null,"1. Līdzdalība radniecīgo sabiedrību kapitālā.",null,"240",null,null,null,null,null,null,"1. Līdzdalība radniecīgo sabiedrību kapitālā.",null,"240"]
[null,"R250",11,"G",null,null,null,"2. Aizdevumi radniecīgajām sabiedrībām.",null,"250",null,null,null,null,null,null,"2. Aizdevumi radniecīgajām sabiedrībām.",null,"250"]
[null,"R260",11,"G",null,null,null,"3. Līdzdalība asociēto sabiedrību kapitālā.",null,"260",null,null,null,null,null,null,"3. Līdzdalība asociēto sabiedrību kapitālā.",null,"260"]
[null,"R270",11,"G",null,null,null,"4. Aizdevumi asociētajām sabiedrībām.",null,"270",null,null,null,null,null,null,"4. Aizdevumi asociētajām sabiedrībām.",null,"270"]
[null,"R280",11,"G",null,null,null,"5. Pārējie vērtspapīri un ieguldījumi.",null,"280",null,null,null,null,null,null,"5. Pārējie vērtspapīri un ieguldījumi.",null,"280"]
[null,"R290",11,"G",null,null,null,"6. Pārējie aizdevumi un citi ilgtermiņa debitori.",null,"290",null,null,null,null,null,null,"6. Pārējie aizdevumi un citi ilgtermiņa debitori.",null,"290"]
[null,"R300",11,"G",null,null,null,"7. Pašu akcijas un daļas.",null,"300",null,null,null,null,null,null,"7. Pašu akcijas un daļas.",null,"300"]
[null,"R310",11,"G",null,null,null,"8. Aizdevumi akcionāriem vai dalībniekiem un vadībai.",null,"310",null,null,null,null,null,null,"8. Aizdevumi akcionāriem vai dalībniekiem un vadībai.",null,"310"]
[null,"R320",11,"G",null,null,null,"9. Atliktā nodokļa aktīvi",null,320,null,null,null,null,null,null,"9. Atliktā nodokļa aktīvi",null,320]
[null,null,null,"S",null,null,null,"III. Ilgtermiņa finanšu ieguldījumi kopā",null,"330",{"$f":"SUM(K31:K39)","v":0},{"$f":"SUM(L31:L39)","v":0},null,null,null,null,"III. Ilgtermiņa finanšu ieguldījumi kopā",null,"330",{"$f":"SUM(T31:T39)","v":0},{"$f":"SUM(U31:U39)","v":0}]
[null,null,null,"S",null,null,null,null,null,"",null,null,null,null,null,null,null,null,""]
[null,null,null,"S",null,null,"Ilgtermiņa ieguldījumi kopā",null,null,"340",{"$f":"SUM(K13,K28,K40)","v":0},{"$f":"SUM(L13,L28,L40)","v":0},null,null,null,"Ilgtermiņa ieguldījumi kopā",null,null,"340",{"$f":"SUM(T13,T28,T40)","v":0},{"$f":"SUM(U13,U28,U40)","v":0}]
[null,null,null,"S",null,null,null,null,null,"",null,null,null,null,null,null,null,null,""]
[null,null,null,"S",null,null,"Apgrozāmie līdzekļi",null,null,"350",null,null,null,null,null,"Apgrozāmie līdzekļi",null,null,"350"]
[null,null,null,"S",null,null,null,"I. Krājumi:",null,"360",null,null,null,null,null,null,"I. Krājumi:",null,"360"]
[null,"R370",{"$f":"COLUMN(K46)","v":11},{"$f":"IF(AND(OR(K46=\"\",K46=0),OR(L46=\"\",L46=0),OR(T46=\"\",T46=0),OR(U46=\"\",U46=0)),\"G\",\"\")","v":"G"},null,null,null,"1. Izejvielas, pamatmateriāli un palīgmateriāli.",null,"370",null,null,null,null,null,null,"1. Izejvielas, pamatmateriāli un palīgmateriāli.",null,"370"]
[null,"R380",11,"G",null,null,null,"2. Nepabeigtie ražojumi un pasūtījumi.",null,"380",null,null,null,null,null,null,"2. Nepabeigtie ražojumi un pasūtījumi.",null,"380"]
[null,"R390",11,"G",null,null,null,"3. Gatavie ražojumi un preces pārdošanai.",null,"390",null,null,null,null,null,null,"3. Gatavie ražojumi un preces pārdošanai.",null,"390"]
[null,"R400",11,"G",null,null,null,"4. Avansa maksājumi par krājumiem.",null,"400",null,null,null,null,null,null,"4. Avansa maksājumi par krājumiem.",null,"400"]
[null,null,null,"G",null,null,null,"5. Dzīvnieki un augi.",null,"410",{"$f":"SUM(K51:K52)","v":0},{"$f":"SUM(L51:L52)","v":0},null,null,null,null,"5. Dzīvnieki un augi.",null,"410",{"$f":"SUM(T51:T52)","v":0},{"$f":"SUM(U51:U52)","v":0}]
[null,"R420",{"$f":"COLUMN(K51)","v":11},"G",null,null,null,"   a) dzīvnieki un viengadīgie stādījumi",null,"420",null,null,null,null,null,null,"   a) dzīvnieki un viengadīgie stādījumi",null,"420"]
[null,"R430",11,"G",null,null,null,"   b) bioloģiskie aktīvi",null,"430",null,null,null,null,null,null,"   b) bioloģiskie aktīvi",null,"430"]
[null,"R440",11,"G",null,null,null,"6. Pārdošanai turēti ilgtermiņa ieguldījumi",null,440,null,null,null,null,null,null,"6. Pārdošanai turēti ilgtermiņa ieguldījumi",null,440]
[null,null,null,"S",null,null,null,"I. Krājumi kopā",null,"450",{"$f":"SUM(K46:K50,K53)","v":0},{"$f":"SUM(L46:L50,L53)","v":0},null,null,null,null,"I. Krājumi kopā",null,"450",{"$f":"SUM(T46:T50,T53)","v":0},{"$f":"SUM(U46:U50,U53)","v":0}]
[null,null,null,"S",null,null,null,null,null,"",null,null,null,null,null,null,null,null,""]
[null,null,null,"S",null,null,null,"II. Debitori:",null,"460",null,null,null,null,null,null,"II. Debitori:",null,"460"]
[null,"R470",{"$f":"COLUMN(K57)","v":11},{"$f":"IF(AND(OR(K57=\"\",K57=0),OR(L57=\"\",L57=0),OR(T57=\"\",T57=0),OR(U57=\"\",U57=0)),\"G\",\"\")","v":"G"},null,null,null,"1. Pircēju un pasūtītāju parādi.",null,"470",null,null,null,null,null,null,"1. Pircēju un pasūtītāju parādi.",null,"470"]
[null,"R480",11,"G",null,null,null,"2. Radniecīgo sabiedrību parādi.",null,"480",null,null,null,null,null,null,"2. Radniecīgo sabiedrību parādi.",null,"480"]
[null,"R490",11,"G",null,null,null,"3. Asociēto sabiedrību parādi.",null,"490",null,null,null,null,null,null,"3. Asociēto sabiedrību parādi.",null,"490"]
[null,"R500",11,"G",null,null,null,"4. Citi debitori.",null,"500",null,null,null,null,null,null,"4. Citi debitori.",null,"500"]
[null,"R510",11,"G",null,null,null,"5. Neiemaksātās daļas sabiedrības kapitālā.",null,"510",null,null,null,null,null,null,"5. Neiemaksātās daļas sabiedrības kapitālā.",null,"510"]
[null,"R520",11,"G",null,null,null,"6. Īstermiņa aizdevumi akcionāriem vai dalībniekiem un vadībai.",null,"520",null,null,null,null,null,null,"6. Īstermiņa aizdevumi akcionāriem vai dalībniekiem un vadībai.",null,"520"]
[null,"R530",11,"G",null,null,null,"7. Nākamo periodu izmaksas.",null,"530",null,null,null,null,null,null,"7. Nākamo periodu izmaksas.",null,"530"]
[null,"R540",11,"G",null,null,null,"8. Uzkrātie ieņēmumi.",null,"540",null,null,null,null,null,null,"8. Uzkrātie ieņēmumi.",null,"540"]
[null,null,null,"S",null,null,null,"II. Debitori kopā",null,"550",{"$f":"SUM(K57:K64)","v":0},{"$f":"SUM(L57:L64)","v":0},null,null,null,null,"II. Debitori kopā",null,"550",{"$f":"SUM(T57:T64)","v":0},{"$f":"SUM(U57:U64)","v":0}]
[null,null,null,"S",null,null,null,null,null,"",null,null,null,null,null,null,null,null,""]
[null,null,null,"S",null,null,null,"III. Īstermiņa finanšu ieguldījumi:",null,"560",null,null,null,null,null,null,"III. Īstermiņa finanšu ieguldījumi:",null,"560"]
[null,"R570",{"$f":"COLUMN(K68)","v":11},{"$f":"IF(AND(OR(K68=\"\",K68=0),OR(L68=\"\",L68=0),OR(T68=\"\",T68=0),OR(U68=\"\",U68=0)),\"G\",\"\")","v":"G"},null,null,null,"1. Līdzdalība radniecīgo sabiedrību kapitālā.",null,"570",null,null,null,null,null,null,"1. Līdzdalība radniecīgo sabiedrību kapitālā.",null,"570"]
[null,"R580",11,"G",null,null,null,"2. Pašu akcijas un daļas.",null,"580",null,null,null,null,null,null,"2. Pašu akcijas un daļas.",null,"580"]
[null,"R590",11,"G",null,null,null,"3. Pārējie vērtspapīri un līdzdalība kapitālos.",null,"590",null,null,null,null,null,null,"3. Pārējie vērtspapīri un līdzdalība kapitālos.",null,"590"]
[null,"R600",11,"G",null,null,null,"4. Atvasinātie finanšu instrumenti.",null,"600",null,null,null,null,null,null,"4. Atvasinātie finanšu instrumenti.",null,"600"]
[null,null,null,"S",null,null,null,"III. Īstermiņa finanšu ieguldījumi kopā",null,"610",{"$f":"SUM(K68:K71)","v":0},{"$f":"SUM(L68:L71)","v":0},null,null,null,null,"III. Īstermiņa finanšu ieguldījumi kopā",null,"610",{"$f":"SUM(T68:T71)","v":0},{"$f":"SUM(U68:U71)","v":0}]
[null,null,null,"S",null,null,null,null,null,"",null,null,null,null,null,null,null,null,""]
[null,"R620",{"$f":"COLUMN(K74)","v":11},"S",null,null,null,"IV. Nauda.",null,"620",null,null,null,null,null,null,"IV. Nauda.",null,"620"]
[null,null,null,"S",null,null,null,null,null,"",null,null,null,null,null,null,null,null,""]
[null,null,null,"S",null,null,"Apgrozāmie līdzekļi",null,null,"630",{"$f":"SUM(K54,K65,K72,K74)","v":0},{"$f":"SUM(L54,L65,L72,L74)","v":0},null,null,null,"Apgrozāmie līdzekļi",null,null,"630",{"$f":"SUM(T54,T65,T72,T74)","v":0},{"$f":"SUM(U54,U65,U72,U74)","v":0}]
[null,null,null,null,null,null,null,null,null,"",null,null,null,null,null,null,null,null,""]
[null,null,null,null,null,null,"BILANCE",null,null,"640",{"$f":"SUM(K42,K76)","v":0},{"$f":"SUM(L42,L76)","v":0},null,null,null,"BILANCE",null,null,"640",{"$f":"SUM(T42,T76)","v":0},{"$f":"SUM(U42,U76)","v":0}]
[]
[null,null,null,null,null,null,null,null,null,null,{"$f":"K78-Pasīvi!K70","v":0},{"$f":"L78-Pasīvi!L70","v":0},null,null,null,null,null,null,null,{"$f":"T78-Pasīvi!T70","v":0},{"$f":"U78-Pasīvi!U70","v":0}]

{"sheet":"Pasīvi","index":3,"n_rows":72,"n_cols":21,"rows_kept":72,"cut":false,"hidden":true,"merged":[]}
[{"$f":"COLUMN(P1)-COLUMN(G1)","v":9},"xmlIdent","xmlClmn","xlGr"]
[]
[null,null,null,null,null,null,"\nBilances pasīvi ",null,null,null,null,null,null,{"$f":"IF(Pamatdati!$H$5=Pamatdati!$Q$5,IF(Pamatdati!$H$8-1=Pamatdati!$Q$9,\"IPG\",\"PG\"),\"N\")","v":"PG"},null,"Tikai salīdzināšanai"]
[]
[null,null,null,null,null,null,"Posteņa nosaukums",null,null,"Rindas kods","Pārskata\ngada beigās","Iepriekšējā\npārskata\ngada beigās",null,null,null,"Posteņa nosaukums",null,null,"Rindas kods","Pārskata\ngada beigās","Iepriekšējā\npārskata\ngada beigās"]
[null,null,null,null,null,null,"Pašu kapitāls:",null,null,"650",null,null,null,null,null,"Pašu kapitāls:",null,null,{"$f":"J6","v":"650"}]
[null,{"$f":"\"R\"&J7","v":"R660"},{"$f":"COLUMN(K7)","v":11},{"$f":"IF(AND(OR(K7=\"\",K7=0),OR(L7=\"\",L7=0),OR(T7=\"\",T7=0),OR(U7=\"\",U7=0)),\"G\",\"\")","v":"G"},null,null,null,"1. Akciju vai daļu kapitāls (pamatkapitāls).",null,"660",null,null,null,null,null,null,"1. Akciju vai daļu kapitāls (pamatkapitāls).",null,"660"]
[null,{"$f":"\"R\"&J8","v":"R670"},11,{"$f":"IF(AND(OR(K8=\"\",K8=0),OR(L8=\"\",L8=0),OR(T8=\"\",T8=0),OR(U8=\"\",U8=0)),\"G\",\"\")","v":"G"},null,null,null,"2. Akciju (daļu) emisijas uzcenojums.",null,"670",null,null,null,null,null,null,"2. Akciju (daļu) emisijas uzcenojums.",null,"670"]
[null,"R680",11,{"$f":"IF(AND(OR(K9=\"\",K9=0),OR(L9=\"\",L9=0),OR(T9=\"\",T9=0),OR(U9=\"\",U9=0)),\"G\",\"\")","v":"G"},null,null,null,"3. Ilgtermiņa ieguldījumu pārvērtēšanas rezerve.",null,"680",null,null,null,null,null,null,"3. Ilgtermiņa ieguldījumu pārvērtēšanas rezerve.",null,"680"]
[null,"R690",11,{"$f":"IF(AND(OR(K10=\"\",K10=0),OR(L10=\"\",L10=0),OR(T10=\"\",T10=0),OR(U10=\"\",U10=0)),\"G\",\"\")","v":"G"},null,null,null,"4. Finanšu instrumentu patiesās vērtības rezerve.",null,"690",null,null,null,null,null,null,"4. Finanšu instrumentu patiesās vērtības rezerve.",null,"690"]
[null,null,null,null,null,null,null,null,null,"",null,null,null,null,null,null,null,null,""]
[null,null,null,null,null,null,null,"5. Rezerves:",null,"700",null,null,null,null,null,null,"5. Rezerves:",null,{"$f":"J12","v":"700"}]
[null,{"$f":"\"R\"&J13","v":"R710"},{"$f":"COLUMN(K13)","v":11},{"$f":"IF(AND(OR(K13=\"\",K13=0),OR(L13=\"\",L13=0),OR(T13=\"\",T13=0),OR(U13=\"\",U13=0)),\"G\",\"\")","v":"G"},null,null,null,"   a) likumā noteiktās rezerves;",null,"710",null,null,null,null,null,null,"   a) likumā noteiktās rezerves;",null,"710"]
[null,"R720",11,"G",null,null,null,"   b) rezerves pašu akcijām vai daļām;",null,"720",null,null,null,null,null,null,"   b) rezerves pašu akcijām vai daļām;",null,"720"]
[null,"R730",11,"G",null,null,null,"   c) sabiedrības statūtos noteiktās rezerves;",null,"730",null,null,null,null,null,null,"   c) sabiedrības statūtos noteiktās rezerves;",null,"730"]
[null,"R740",11,"G",null,null,null,"   d) rezerves, kas novirzītas attīstībai;",null,"740",null,null,null,null,null,null,"   d) rezerves, kas novirzītas attīstībai;",null,"740"]
[null,"R760",11,"G",null,null,null,"   e) pārējās rezerves.",null,"760",null,null,null,null,null,null,"   e) pārējās rezerves.",null,"760"]
[null,null,null,"S",null,null,null,"Rezerves kopā",null,"770",{"$f":"SUM(K13:K17)","v":0},{"$f":"SUM(L13:L17)","v":0},null,null,null,null,"Rezerves kopā",null,"770",{"$f":"SUM(T13:T17)","v":0},{"$f":"SUM(U13:U17)","v":0}]
[null,null,null,"S",null,null,null,null,null,"",null,null,null,null,null,null,null,null,""]
[null,{"$f":"\"R\"&J20","v":"R780"},{"$f":"COLUMN(K20)","v":11},"S",null,null,null,"6. Iepriekšējo gadu nesadalītā peļņa vai nesegtie zaudējumi",null,"780",null,null,null,null,null,null,"6. Iepriekšējo gadu nesadalītā peļņa vai nesegtie zaudējumi",null,{"$f":"J20","v":"780"}]
[null,"R790",11,"S",null,null,null,"7. Pārskata gada peļņa vai zaudējumi",null,"790",null,null,null,null,null,null,"7. Pārskata gada peļņa vai zaudējumi",null,"790"]
[null,"R---",11,"G",null,null,null,"8. Mazākumakcionāru līdzdalības daļa",null,{"$f":"IF(Pamatdati!H3=\"Konsolidētais uzņēmuma gada pārskats\",800,\"---\")","v":"---"},null,null,null,null,null,null,"8. Mazākumakcionāru līdzdalības daļa",null,"---"]
[null,null,null,"S",null,null,null,null,null,"",null,null,null,null,null,null,null,null,""]
[null,null,null,"S",null,null,"Pašu kapitāls kopā",null,null,{"$f":"IF(Pamatdati!H3=\"Konsolidētais uzņēmuma gada pārskats\",J22+10,J21+10)","v":800},{"$f":"SUM(K7:K10,K18,K20:K21)","v":0},{"$f":"SUM(L7:L10,L18,L20:L21)","v":0},null,null,null,"Pašu kapitāls kopā",null,null,{"$f":"J24","v":800},{"$f":"SUM(T7:T10,T18,T20:T21)","v":0},{"$f":"SUM(U7:U10,U18,U20:U21)","v":0}]
[null,null,null,"S",null,null,null,null,null,"",null,null,null,null,null,null,null,null,""]
[null,null,null,"S",null,null,"Uzkrājumi:",null,null,{"$f":"J24+10","v":810},null,null,null,null,null,"Uzkrājumi:",null,null,{"$f":"J26","v":810}]
[null,{"$f":"\"R\"&J27","v":"R820"},{"$f":"COLUMN(K27)","v":11},{"$f":"IF(AND(OR(K27=\"\",K27=0),OR(L27=\"\",L27=0),OR(T27=\"\",T27=0),OR(U27=\"\",U27=0)),\"G\",\"\")","v":"G"},null,null,null,"1. Uzkrājumi pensijām un tamlīdzīgām saistībām.",null,{"$f":"J26+10","v":820},null,null,null,null,null,null,"1. Uzkrājumi pensijām un tamlīdzīgām saistībām.",null,820]
[null,"R830",11,{"$f":"IF(AND(OR(K28=\"\",K28=0),OR(L28=\"\",L28=0),OR(T28=\"\",T28=0),OR(U28=\"\",U28=0)),\"G\",\"\")","v":"G"},null,null,null,"2. Uzkrājumi paredzamajiem nodokļiem.",null,{"$f":"J27+10","v":830},null,null,null,null,null,null,"2. Uzkrājumi paredzamajiem nodokļiem.",null,830]
[null,"R840",11,{"$f":"IF(AND(OR(K29=\"\",K29=0),OR(L29=\"\",L29=0),OR(T29=\"\",T29=0),OR(U29=\"\",U29=0)),\"G\",\"\")","v":"G"},null,null,null,"3. Citi uzkrājumi.",null,840,null,null,null,null,null,null,"3. Citi uzkrājumi.",null,840]
[null,null,null,"S",null,null,null,null,null,"",null,null,null,null,null,null,null,null,""]
[null,null,null,"S",null,null,"Uzkrājumi kopā",null,null,{"$f":"J29+10","v":850},{"$f":"SUM(K27:K29)","v":0},{"$f":"SUM(L27:L29)","v":0},null,null,null,"Uzkrājumi kopā",null,null,{"$f":"J31","v":850},{"$f":"SUM(T27:T29)","v":0},0]
[null,null,null,"S",null,null,null,null,null,"",null,null,null,null,null,null,null,null,""]
[null,null,null,"S",null,null,"Ilgtermiņa kreditori:",null,null,{"$f":"J31+10","v":860},null,null,null,null,null,"Ilgtermiņa kreditori:",null,null,{"$f":"J33","v":860}]
[null,{"$f":"\"R\"&J34","v":"R870"},{"$f":"COLUMN(K34)","v":11},{"$f":"IF(AND(OR(K34=\"\",K34=0),OR(L34=\"\",L34=0),OR(T34=\"\",T34=0),OR(U34=\"\",U34=0)),\"G\",\"\")","v":"G"},null,null,null,"1. Aizņēmumi pret obligācijām.",null,{"$f":"J33+10","v":870},null,null,null,null,null,null,"1. Aizņēmumi pret obligācijām.",null,870]
[null,"R880",11,"G",null,null,null,"2. Akcijās pārvēršamie aizņēmumi.",null,880,null,null,null,null,null,null,"2. Akcijās pārvēršamie aizņēmumi.",null,880]
[null,"R890",11,"G",null,null,null,"3. Aizņēmumi no kredītiestādēm.",null,890,null,null,null,null,null,null,"3. Aizņēmumi no kredītiestādēm.",null,890]
[null,"R900",11,"G",null,null,null,"4. Citi aizņēmumi.",null,900,null,null,null,null,null,null,"4. Citi aizņēmumi.",null,900]
[null,"R910",11,"G",null,null,null,"5. No pircējiem saņemtie avansi.",null,910,null,null,null,null,null,null,"5. No pircējiem saņemtie avansi.",null,910]
[null,"R920",11,"G",null,null,null,"6. Parādi piegādātājiem un darbuzņēmējiem.",null,920,null,null,null,null,null,null,"6. Parādi piegādātājiem un darbuzņēmējiem.",null,920]
[null,"R930",11,"G",null,null,null,"7. Maksājamie vekseļi.",null,930,null,null,null,null,null,null,"7. Maksājamie vekseļi.",null,930]
[null,"R940",11,"G",null,null,null,"8. Parādi radniecīgajām sabiedrībām.",null,940,null,null,null,null,null,null,"8. Parādi radniecīgajām sabiedrībām.",null,940]
[null,"R950",11,"G",null,null,null,"9. Parādi asociētajām sabiedrībām.",null,950,null,null,null,null,null,null,"9. Parādi asociētajām sabiedrībām.",null,950]
[null,"R960",11,"G",null,null,null,"10. Nodokļi un valsts sociālās apdrošināšanas obligātās iemaksas.",null,960,null,null,null,null,null,null,"10. Nodokļi un valsts sociālās apdrošināšanas obligātās iemaksas.",null,960]
[null,"R970",11,"G",null,null,null,"11. Atliktā nodokļa saistības",null,970,null,null,null,null,null,null,"11. Atliktā nodokļa saistības",null,970]
[null,"R980",11,"G",null,null,null,"12. Pārējie kreditori.",null,980,null,null,null,null,null,null,"12. Pārējie kreditori.",null,980]
[null,"R990",11,"G",null,null,null,"13. Nākamo periodu ieņēmumi.",null,990,null,null,null,null,null,null,"13. Nākamo periodu ieņēmumi.",null,990]
[null,"R1000",11,"G",null,null,null,"14. Neizmaksātās dividendes.",null,1000,null,null,null,null,null,null,"14. Neizmaksātās dividendes.",null,1000]
[null,null,null,"S",null,null,null,null,null,"",null,null,null,null,null,null,null,null,""]
[null,null,null,"S",null,null,"Ilgtermiņa kreditori kopā",null,null,{"$f":"J47+10","v":1010},{"$f":"SUM(K34:K47)","v":0},{"$f":"SUM(L34:L47)","v":0},null,null,null,"Ilgtermiņa kreditori kopā",null,null,{"$f":"J49","v":1010},{"$f":"SUM(T34:T47)","v":0},0]
[null,null,null,"S",null,null,null,null,null,"",null,null,null,null,null,null,null,null,""]
[null,null,null,"S",null,null,"Īstermiņa kreditori:",null,null,{"$f":"J49+10","v":1020},null,null,null,null,null,"Īstermiņa kreditori:",null,null,{"$f":"J51","v":1020}]
[null,{"$f":"\"R\"&J52","v":"R1030"},{"$f":"COLUMN(K52)","v":11},{"$f":"IF(AND(OR(K52=\"\",K52=0),OR(L52=\"\",L52=0),OR(T52=\"\",T52=0),OR(U52=\"\",U52=0)),\"G\",\"\")","v":"G"},null,null,null,"1. Aizņēmumi pret obligācijām.",null,{"$f":"J51+10","v":1030},null,null,null,null,null,null,"1. Aizņēmumi pret obligācijām.",null,1030]
[null,"R1040",11,"G",null,null,null,"2. Akcijās pārvēršamie aizņēmumi.",null,1040,null,null,null,null,null,null,"2. Akcijās pārvēršamie aizņēmumi.",null,1040]
[null,"R1050",11,"G",null,null,null,"3. Aizņēmumi no kredītiestādēm.",null,1050,null,null,null,null,null,null,"3. Aizņēmumi no kredītiestādēm.",null,1050]
[null,"R1060",11,"G",null,null,null,"4. Citi aizņēmumi.",null,1060,null,null,null,null,null,null,"4. Citi aizņēmumi.",null,1060]
[null,"R1070",11,"G",null,null,null,"5. No pircējiem saņemtie avansi.",null,1070,null,null,null,null,null,null,"5. No pircējiem saņemtie avansi.",null,1070]
[null,"R1080",11,"G",null,null,null,"6. Parādi piegādātājiem un darbuzņēmējiem.",null,1080,null,null,null,null,null,null,"6. Parādi piegādātājiem un darbuzņēmējiem.",null,1080]
[null,"R1090",11,"G",null,null,null,"7. Maksājamie vekseļi.",null,1090,null,null,null,null,null,null,"7. Maksājamie vekseļi.",null,1090]
[null,"R1100",11,"G",null,null,null,"8. Parādi radniecīgajām sabiedrībām.",null,1100,null,null,null,null,null,null,"8. Parādi radniecīgajām sabiedrībām.",null,1100]
[null,"R1110",11,"G",null,null,null,"9. Parādi asociētajām sabiedrībām.",null,1110,null,null,null,null,null,null,"9. Parādi asociētajām sabiedrībām.",null,1110]
[null,"R1120",11,"G",null,null,null,"10. Nodokļi un valsts sociālās apdrošināšanas obligātās iemaksas.",null,1120,null,null,null,null,null,null,"10. Nodokļi un valsts sociālās apdrošināšanas obligātās iemaksas.",null,1120]
[null,"R1130",11,"G",null,null,null,"11. Pārējie kreditori.",null,1130,null,null,null,null,null,null,"11. Pārējie kreditori.",null,1130]
[null,"R1140",11,"G",null,null,null,"12. Nākamo periodu ieņēmumi.",null,1140,null,null,null,null,null,null,"12. Nākamo periodu ieņēmumi.",null,1140]
[null,"R1150",11,"G",null,null,null,"13. Neizmaksātās dividendes.",null,1150,null,null,null,null,null,null,"13. Neizmaksātās dividendes.",null,1150]
[null,"R1160",11,"G",null,null,null,"14. Uzkrātās saistības.",null,1160,null,null,null,null,null,null,"14. Uzkrātās saistības.",null,1160]
[null,"R1170",11,"G",null,null,null,"15. Atvasinātie finanšu instrumenti.",null,1170,null,null,null,null,null,null,"15. Atvasinātie finanšu instrumenti.",null,1170]
[null,null,null,"S",null,null,null,null,null,"",null,null,null,null,null,null,null,null,""]
[null,null,null,"S",null,null,"Īstermiņa kreditori kopā",null,null,{"$f":"J66+10","v":1180},{"$f":"SUM(K52:K66)","v":0},{"$f":"SUM(L52:L66)","v":0},null,null,null,"Īstermiņa kreditori kopā",null,null,{"$f":"J68","v":1180},{"$f":"SUM(T52:T66)","v":0},0]
[null,null,null,null,null,null,null,null,null,"",null,null,null,null,null,null,null,null,""]
[null,null,null,null,null,null,"BILANCE",null,null,{"$f":"J68+10","v":1190},{"$f":"SUM(K24,K31,K49,K68)","v":0},{"$f":"SUM(L24,L31,L49,L68)","v":0},null,null,null,"BILANCE",null,null,{"$f":"J70","v":1190},{"$f":"SUM(T24,T31,T49,T68)","v":0},{"$f":"SUM(U24,U31,U49,U68)","v":0}]
[]
[null,null,null,null,null,null,null,null,null,null,{"$f":"K70-Aktīvi!K78","v":0},{"$f":"L70-Aktīvi!L78","v":0},null,null,null,null,null,null,null,{"$f":"T70-Aktīvi!T78","v":0},{"$f":"U70-Aktīvi!U78","v":0}]

{"sheet":"PZA1","index":4,"n_rows":48,"n_cols":21,"rows_kept":48,"cut":false,"hidden":true,"merged":[[47,7,47,8],[47,16,47,17],[44,16,44,17],[45,16,45,17],[46,16,46,17],[44,7,44,8],[45,7,45,8],[46,7,46,8],[39,16,39,17],[40,16,40,17],[41,16,41,17],[42,16,42,17],[43,16,43,17],[31,16,31,17],[32,16,32,17],[33,16,33,17],[34,16,34,17],[38,16,38,17],[35,16,35,17],[36,16,36,17],[37,16,37,17],[26,16,26,17],[27,16,27,17],[28,16,28,17],[29,16,29,17],[30,16,30,17],[21,16,21,17],[22,16,22,17],[23,16,23,17],[24,16,24,17],[25,16,25,17],[16,16,16,17],[17,16,17,17],[18,16,18,17],[19,16,19,17],[20,16,20,17],[11,16,11,17],[12,16,12,17],[13,16,13,17],[14,16,14,17],[15,16,15,17],[5,16,5,17],[6,16,6,17],[8,16,8,17],[9,16,9,17],[10,16,10,17],[5,7,5,8],[6,7,6,8],[8,7,8,8],[11,7,11,8],[12,7,12,8],[13,7,13,8],[14,7,14,8],[9,7,9,8],[10,7,10,8],[17,7,17,8],[20,7,20,8],[18,7,18,8],[19,7,19,8],[15,7,15,8],[16,7,16,8],[21,7,21,8],[41,7,41,8],[42,7,42,8],[30,7,30,8],[22,7,22,8],[23,7,23,8],[24,7,24,8],[27,7,27,8],[28,7,28,8],[29,7,29,8],[25,7,25,8],[26,7,26,8],[43,7,43,8],[31,7,31,8],[32,7,32,8],[33,7,33,8],[34,7,34,8],[38,7,38,8],[39,7,39,8],[40,7,40,8],[35,7,35,8],[36,7,36,8],[37,7,37,8]]}
[{"$f":"COLUMN(P1)-COLUMN(G1)","v":9},"xmlIdent","xmlClmn","xlGr"]
[]
[null,null,null,null,null,null,"PZA - Klasificēts pēc izdevumu veidiem (PZA1)",null,null,null,null,null,null,{"$f":"IF(Pamatdati!$H$5=Pamatdati!$Q$5,IF(Pamatdati!$H$8-1=Pamatdati!$Q$9,\"IPG\",\"PG\"),\"N\")","v":"PG"},null,"Tikai salīdzināšanai"]
[]
[null,null,null,null,null,null,"Posteņa nosaukums",null,null,"Rindas kods","Pārskata\ngada beigās","Iepriekšējā\npārskata\ngada beigās",null,null,null,"Posteņa nosaukums",null,null,"Rindas kods","Pārskata\ngada beigās","Iepriekšējā\npārskata\ngada beigās"]
[null,null,null,null,null,null,null,"1. Neto apgrozījums.",null,10,{"$f":"SUM(K7:K9)","v":0},{"$f":"SUM(L7:L9)","v":0},null,null,null,null,"1. Neto apgrozījums.",null,{"$f":"J6","v":10},{"$f":"SUM(T7:T9)","v":0},{"$f":"SUM(U7:U9)","v":0}]
[null,"R20",{"$f":"COLUMN(K7)","v":11},{"$f":"IF(AND(OR(K7=\"\",K7=0),OR(L7=\"\",L7=0),OR(T7=\"\",T7=0),OR(U7=\"\",U7=0)),\"G\",\"\")","v":"G"},null,null,null,"a) no lauksaimnieciskās darbības",null,20,null,null,null,null,null,null,"a) no lauksaimnieciskās darbības",null,{"$f":"J7","v":20}]
[null,"R30",{"$f":"COLUMN(K8)","v":11},{"$f":"IF(AND(OR(K8=\"\",K8=0),OR(L8=\"\",L8=0),OR(T8=\"\",T8=0),OR(U8=\"\",U8=0)),\"G\",\"\")","v":"G"},null,null,null,"b) no citiem pamatdarbības veidiem",null,30,null,null,null,null,null,null,"b) no citiem pamatdarbības veidiem",null,30]
[null,"R10R1",11,"G",null,null,null,"c) no būvniecības darbiem",null,10.1,null,null,null,null,null,null,"c) no būvniecības darbiem",null,10.1]
[null,"R40",11,"G",null,null,null,"2. Gatavās produkcijas un nepabeigto ražojumu krājumu izmaiņas.",null,40,null,null,null,null,null,null,"2. Gatavās produkcijas un nepabeigto ražojumu krājumu izmaiņas.",null,40]
[null,"R50",11,"G",null,null,null,"3. Uz pašu ilgtermiņa ieguldījumiem attiecinātās (kapitalizētās) izmaksas.",null,50,null,null,null,null,null,null,"3. Uz pašu ilgtermiņa ieguldījumiem attiecinātās (kapitalizētās) izmaksas.",null,50]
[null,"R60",11,"G",null,null,null,"4. Pārējie saimnieciskās darbības ieņēmumi.",null,60,null,null,null,null,null,null,"4. Pārējie saimnieciskās darbības ieņēmumi.",null,60]
[null,null,null,"G",null,null,null,"5. Materiālu izmaksas:",null,70,{"$f":"SUM(K14:K15)","v":0},{"$f":"SUM(L14:L15)","v":0},null,null,null,null,"5. Materiālu izmaksas:",null,70,{"$f":"SUM(T14:T15)","v":0},{"$f":"SUM(U14:U15)","v":0}]
[null,{"$f":"\"R\"&J14","v":"R80"},{"$f":"COLUMN(K14)","v":11},"G",null,null,null,"a) izejvielu un palīgmateriālu izmaksas;",null,80,null,null,null,null,null,null,"a) izejvielu un palīgmateriālu izmaksas;",null,80]
[null,{"$f":"\"R\"&J15","v":"R90"},11,"G",null,null,null,"b) pārējās ārējās izmaksas.",null,90,null,null,null,null,null,null,"b) pārējās ārējās izmaksas.",null,90]
[null,null,null,"G",null,null,null,"6. Personāla izmaksas:",null,100,{"$f":"SUM(K17:K20)","v":0},{"$f":"SUM(L17:L20)","v":0},null,null,null,null,"6. Personāla izmaksas:",null,100,{"$f":"SUM(T17:T20)","v":0},{"$f":"SUM(U17:U20)","v":0}]
[null,{"$f":"\"R\"&J17","v":"R110"},{"$f":"COLUMN(K17)","v":11},"G",null,null,null,"a) atlīdzība par darbu",null,110,null,null,null,null,null,null,"a) atlīdzība par darbu",null,110]
[null,"R120",11,"G",null,null,null,"b) pensijas no sabiedrības līdzekļiem",null,120,null,null,null,null,null,null,"b) pensijas no sabiedrības līdzekļiem",null,120]
[null,"R130",11,"G",null,null,null,"c) valsts sociālās apdrošināšanas obligātās iemaksas",null,130,null,null,null,null,null,null,"c) valsts sociālās apdrošināšanas obligātās iemaksas",null,130]
[null,"R140",11,"G",null,null,null,"d) pārējās sociālās nodrošināšanas izmaksas",null,140,null,null,null,null,null,null,"d) pārējās sociālās nodrošināšanas izmaksas",null,140]
[null,null,null,"G",null,null,null,"7. Vērtības samazinājuma korekcijas:",null,150,{"$f":"SUM(K22:K23)","v":0},{"$f":"SUM(L22:L23)","v":0},null,null,null,null,"7. Vērtības samazinājuma korekcijas:",null,150,{"$f":"SUM(T22:T23)","v":0},{"$f":"SUM(U22:U23)","v":0}]
[null,{"$f":"\"R\"&J22","v":"R160"},{"$f":"COLUMN(K22)","v":11},"G",null,null,null,"a) pamatlīdzekļu un nemateriālo ieguldījumu vērtības samazinājuma korekcijas;",null,160,null,null,null,null,null,null,"a) pamatlīdzekļu un nemateriālo ieguldījumu vērtības samazinājuma korekcijas;",null,160]
[null,"R170",11,"G",null,null,null,"b) apgrozāmo līdzekļu vērtības samazinājuma korekcijas, ja tās pārsniedz tādas vērtības norakstījumu summas, kuras attiecīgā sabiedrība uzskata par parastām.",null,170,null,null,null,null,null,null,"b) apgrozāmo līdzekļu vērtības samazinājuma korekcijas, ja tās pārsniedz tādas vērtības norakstījumu summas, kuras attiecīgā sabiedrība uzskata par parastām.",null,170]
[null,"R180",11,"G",null,null,null,"8. Pārējās saimnieciskās darbības izmaksas",null,180,null,null,null,null,null,null,"8. Pārējās saimnieciskās darbības izmaksas",null,180]
[null,null,null,"G",null,null,null,"9. Ieņēmumi no līdzdalības:",null,190,{"$f":"SUM(K26:K28)","v":0},{"$f":"SUM(L26:L28)","v":0},null,null,null,null,"9. Ieņēmumi no līdzdalības:",null,190,{"$f":"SUM(T26:T28)","v":0},{"$f":"SUM(U26:U28)","v":0}]
[null,{"$f":"\"R\"&J26","v":"R200"},{"$f":"COLUMN(K26)","v":11},"G",null,null,null,"a) radniecīgo sabiedrību kapitālā",null,200,null,null,null,null,null,null,"a) radniecīgo sabiedrību kapitālā",null,200]
[null,"R210",11,"G",null,null,null,"b) asociēto sabiedrību kapitālā",null,210,null,null,null,null,null,null,"b) asociēto sabiedrību kapitālā",null,210]
[null,"R220",11,"G",null,null,null,"c) citu sabiedrību kapitālā",null,220,null,null,null,null,null,null,"c) citu sabiedrību kapitālā",null,220]
[null,null,null,"G",null,null,null,"10. Ieņēmumi no pārējiem vērtspapīriem un aizdevumiem, kas veidojuši ilgtermiņa finanšu ieguldījumus.",null,230,{"$f":"SUM(K30:K31)","v":0},{"$f":"SUM(L30:L31)","v":0},null,null,null,null,"10. Ieņēmumi no pārējiem vērtspapīriem un aizdevumiem, kas veidojuši ilgtermiņa finanšu ieguldījumus.",null,230,{"$f":"SUM(T30:T31)","v":0},{"$f":"SUM(U30:U31)","v":0}]
[null,{"$f":"\"R\"&J30","v":"R240"},{"$f":"COLUMN(K30)","v":11},"G",null,null,null,"a) no radniecīgajām sabiedrībām",null,240,null,null,null,null,null,null,"a) no radniecīgajām sabiedrībām",null,240]
[null,"R250",11,"G",null,null,null,"b) no asociētajām sabiedrībām un citām sabiedrībām, kā arī no vērtspapīriem un citiem ilgtermiņa debitoriem",null,250,null,null,null,null,null,null,"b) no asociētajām sabiedrībām un citām sabiedrībām, kā arī no vērtspapīriem un citiem ilgtermiņa debitoriem",null,250]
[null,null,null,"G",null,null,null,"11. Pārējie procentu ieņēmumi un tamlīdzīgi ieņēmumi.",null,260,{"$f":"SUM(K33:K34)","v":0},{"$f":"SUM(L33:L34)","v":0},null,null,null,null,"11. Pārējie procentu ieņēmumi un tamlīdzīgi ieņēmumi.",null,260,{"$f":"SUM(T33:T34)","v":0},{"$f":"SUM(U33:U34)","v":0}]
[null,{"$f":"\"R\"&J33","v":"R270"},{"$f":"COLUMN(K33)","v":11},"G",null,null,null,"a) no radniecīgajām sabiedrībām",null,270,null,null,null,null,null,null,"a) no radniecīgajām sabiedrībām",null,270]
[null,"R280",11,"G",null,null,null,"b) no citām personām.",null,280,null,null,null,null,null,null,"b) no citām personām.",null,280]
[null,"R290",11,"G",null,null,null,"12. Ilgtermiņa un īstermiņa finanšu ieguldījumu vērtības samazinājuma korekcijas",null,{"$f":"IF(Pamatdati!$H$3<>\"Konsolidētais uzņēmuma gada pārskats\",J34+10,\"---\")","v":290},null,null,null,null,null,null,"12. Ilgtermiņa un īstermiņa finanšu ieguldījumu vērtības samazinājuma korekcijas",null,290]
[null,null,null,"G",null,null,null,"12. Ilgtermiņa un īstermiņa finanšu ieguldījumu vērtības samazinājuma korekcijas",null,{"$f":"IF(Pamatdati!$H$3=\"Konsolidētais uzņēmuma gada pārskats\",J34+10,\"---\")","v":"---"},{"$f":"SUM(K37:K38)","v":0},{"$f":"SUM(L37:L38)","v":0},null,null,null,null,"12. Ilgtermiņa un īstermiņa finanšu ieguldījumu vērtības samazinājuma korekcijas",null,"---",{"$f":"SUM(T37:T38)","v":0},{"$f":"SUM(U37:U38)","v":0}]
[null,{"$f":"\"R\"&J37","v":"R---"},{"$f":"COLUMN(K37)","v":11},"G",null,null,null,"a) līdzdalības asociēto sabiedrību kapitālā vērtības samazināšanās",null,{"$f":"IF(Pamatdati!$H$3=\"Konsolidētais uzņēmuma gada pārskats\",J36+10,\"---\")","v":"---"},null,null,null,null,null,null,"a) līdzdalības asociēto sabiedrību kapitālā \nvērtības samazināšanās",null,"---"]
[null,"R---",11,"G",null,null,null,"b) pārējās vērtības samazinājuma korekcijas.",null,{"$f":"IF(Pamatdati!$H$3=\"Konsolidētais uzņēmuma gada pārskats\",J37+10,\"---\")","v":"---"},null,null,null,null,null,null,"b) pārējās vērtības samazinājuma korekcijas.",null,"---"]
[null,null,null,"G",null,null,null,"13. Procentu maksājumi un tamlīdzīgas izmaksas",null,{"$f":"IF(Pamatdati!$H$3=\"Konsolidētais uzņēmuma gada pārskats\",J38+10,J35+10)","v":300},{"$f":"SUM(K40:K41)","v":0},{"$f":"SUM(L40:L41)","v":0},null,null,null,null,"13. Procentu maksājumi un tamlīdzīgas izmaksas",null,300,{"$f":"SUM(T40:T41)","v":0},{"$f":"SUM(U40:U41)","v":0}]
[null,{"$f":"\"R\"&J40","v":"R310"},{"$f":"COLUMN(K40)","v":11},"G",null,null,null,"a) no radniecīgajām sabiedrībām",null,{"$f":"J39+10","v":310},null,null,null,null,null,null,"a) no radniecīgajām sabiedrībām",null,310]
[null,"R320",11,"G",null,null,null,"b) no citām personām.",null,{"$f":"J40+10","v":320},null,null,null,null,null,null,"b) no citām personām.",null,320]
[null,null,null,null,null,null,null,"14. Peļņa vai zaudējumi pirms uzņēmumu ienākuma nodokļa",null,330,{"$f":"K6+K10+K11+K12-K13-K16-K21-K24+K25+K29+K32+K35+K36-K39","v":0},{"$f":"L6+L10+L11+L12-L13-L16-L21-L24+L25+L29+L32+L35+L36-L39","v":0},null,null,null,null,"14. Peļņa vai zaudējumi pirms uzņēmumu ienākuma nodokļa",null,330,{"$f":"T6+T10+T11+T12-T13-T16-T21-T24+T25+T29+T32+T35+T36-T39","v":0},0]
[null,{"$f":"\"R\"&J43","v":"R340"},11,{"$f":"IF(AND(OR(K43=\"\",K43=0),OR(L43=\"\",L43=0),OR(T43=\"\",T43=0),OR(U43=\"\",U43=0)),\"G\",\"\")","v":"G"},null,null,null,"15. Uzņēmumu ienākuma nodoklis par pārskata gadu",null,340,null,null,null,null,null,null,"15. Uzņēmumu ienākuma nodoklis par pārskata gadu",null,340]
[null,null,null,null,null,null,null,"16. Peļņa vai zaudējumi pēc uzņēmumu ienākuma nodokļa aprēķināšanas",null,350,{"$f":"K42-K43","v":0},{"$f":"L42-L43","v":0},null,null,null,null,"16. Peļņa vai zaudējumi pēc uzņēmumu ienākuma nodokļa aprēķināšanas",null,350,{"$f":"T42-T43","v":0},{"$f":"U42-U43","v":0}]
[null,{"$f":"\"R\"&J45","v":"R360"},11,{"$f":"IF(AND(OR(K45=\"\",K45=0),OR(L45=\"\",L45=0),OR(T45=\"\",T45=0),OR(U45=\"\",U45=0)),\"G\",\"\")","v":"G"},null,null,null,"17. Ieņēmumi vai izmaksas no atliktā nodokļa aktīvu vai saistību atlikumu izmaiņām",null,360,null,null,null,null,null,null,"17. Ieņēmumi vai izmaksas no atliktā nodokļa aktīvu vai saistību atlikumu izmaiņām",null,360]
[null,"R370",11,{"$f":"IF(AND(OR(K46=\"\",K46=0),OR(L46=\"\",L46=0),OR(T46=\"\",T46=0),OR(U46=\"\",U46=0)),\"G\",\"\")","v":"G"},null,null,null,"18. Ārkārtas dividendes",null,370,null,null,null,null,null,null,"18. Ārkārtas dividendes",null,370]
[null,null,null,null,null,null,null,"19. Pārskata gada peļņa vai zaudējumi",null,380,{"$f":"K44+K45-K46","v":0},{"$f":"L44+L45-L46","v":0},null,null,null,null,"19. Pārskata gada peļņa vai zaudējumi",null,380,{"$f":"T44+T45-T46","v":0},{"$f":"U44+U45-U46","v":0}]
[null,"R410",{"$f":"COLUMN(K48)","v":11},{"$f":"IF(AND(OR(K48=\"\",K48=0),OR(L48=\"\",L48=0),OR(T48=\"\",T48=0),OR(U48=\"\",U48=0)),\"G\",\"\")","v":"G"},null,null,null,"20. Mazākumakcionāru peļņas vai zaudējumu daļa",null,410,null,null,null,null,null,null,"20. Mazākumakcionāru peļņas vai zaudējumu \ndaļa",null,410]

{"sheet":"PZA2","index":5,"n_rows":41,"n_cols":21,"rows_kept":41,"cut":false,"hidden":true,"merged":[[35,16,35,17],[36,16,36,17],[37,16,37,17],[29,16,29,17],[30,16,30,17],[31,16,31,17],[32,16,32,17],[33,16,33,17],[21,16,21,17],[22,16,22,17],[23,16,23,17],[24,16,24,17],[26,16,26,17],[25,16,25,17],[16,16,16,17],[17,16,17,17],[18,16,18,17],[19,16,19,17],[20,16,20,17],[11,16,11,17],[12,16,12,17],[13,16,13,17],[14,16,14,17],[15,16,15,17],[5,16,5,17],[6,16,6,17],[8,16,8,17],[9,16,9,17],[10,16,10,17],[5,7,5,8],[6,7,6,8],[8,7,8,8],[12,7,12,8],[9,7,9,8],[11,7,11,8],[10,7,10,8],[14,7,14,8],[13,7,13,8],[22,7,22,8],[19,7,19,8],[20,7,20,8],[16,7,16,8],[17,7,17,8],[18,7,18,8],[21,7,21,8],[24,7,24,8],[23,7,23,8],[15,7,15,8],[25,7,25,8],[26,7,26,8],[38,7,38,8],[38,16,38,17],[27,7,27,8],[27,16,27,17],[28,7,28,8],[28,16,28,17],[37,7,37,8],[36,7,36,8],[35,7,35,8],[34,7,34,8],[33,7,33,8],[32,7,32,8],[29,7,29,8],[30,7,30,8],[31,7,31,8],[34,16,34,17]]}
[{"$f":"COLUMN(P1)-COLUMN(G1)","v":9},"xmlIdent","xmlClmn","xlGr"]
[]
[null,null,null,null,null,null,"PZA - Klasificēts pēc izdevumu funkcijām (PZA2)",null,null,null,null,null,null,{"$f":"IF(Pamatdati!$H$5=Pamatdati!$Q$5,IF(Pamatdati!$H$8-1=Pamatdati!$Q$9,\"IPG\",\"PG\"),\"N\")","v":"PG"},null,"Tikai salīdzināšanai"]
[]
[null,null,null,null,null,null,"Posteņa nosaukums",null,null,"Rindas kods","Pārskata\ngada beigās","Iepriekšējā\npārskata\ngada beigās",null,null,null,"Posteņa nosaukums",null,null,"Rindas kods","Pārskata\ngada beigās","Iepriekšējā\npārskata\ngada beigās"]
[null,null,null,null,null,null,null,"1. Neto apgrozījums.",null,10,{"$f":"SUM(K7:K9)","v":0},{"$f":"SUM(L7:L9)","v":0},null,null,null,null,"1. Neto apgrozījums.",null,{"$f":"J6","v":10},{"$f":"SUM(T7:T9)","v":0},{"$f":"SUM(U7:U9)","v":0}]
[null,"R20",{"$f":"COLUMN(K7)","v":11},{"$f":"IF(AND(OR(K7=\"\",K7=0),OR(L7=\"\",L7=0),OR(T7=\"\",T7=0),OR(U7=\"\",U7=0)),\"G\",\"\")","v":"G"},null,null,null,"   a) no lauksaimnieciskās darbības",null,20,null,null,null,null,null,null,"a) no lauksaimnieciskās darbības",null,{"$f":"J7","v":20}]
[null,"R30",{"$f":"COLUMN(K8)","v":11},{"$f":"IF(AND(OR(K8=\"\",K8=0),OR(L8=\"\",L8=0),OR(T8=\"\",T8=0),OR(U8=\"\",U8=0)),\"G\",\"\")","v":"G"},null,null,null,"   b) no citiem pamatdarbības veidiem",null,30,null,null,null,null,null,null,"b) no citiem pamatdarbības veidiem",null,30]
[null,"R10R1",11,{"$f":"IF(AND(OR(K9=\"\",K9=0),OR(L9=\"\",L9=0),OR(T9=\"\",T9=0),OR(U9=\"\",U9=0)),\"G\",\"\")","v":"G"},null,null,null,"   c) no būvniecības darbiem",null,10.1,null,null,null,null,null,null,"c) no būvniecības darbiem",null,10.1]
[null,"R40",11,{"$f":"IF(AND(OR(K10=\"\",K10=0),OR(L10=\"\",L10=0),OR(T10=\"\",T10=0),OR(U10=\"\",U10=0)),\"G\",\"\")","v":"G"},null,null,null,"2. Pārdotās produkcijas ražošanas pašizmaksa, pārdoto preču vai sniegto pakalpojumu iegādes izmaksas",null,40,null,null,null,null,null,null,"2. Pārdotās produkcijas ražošanas pašizmaksa, pārdoto preču vai sniegto pakalpojumu iegādes izmaksas",null,40]
[null,null,null,null,null,null,null,"3. Bruto peļņa vai zaudējumi.",null,50,{"$f":"K6-K10","v":0},{"$f":"L6-L10","v":0},null,null,null,null,"3. Bruto peļņa vai zaudējumi.",null,50,{"$f":"T6-T10","v":0},{"$f":"U6-U10","v":0}]
[null,"R60",11,{"$f":"IF(AND(OR(K12=\"\",K12=0),OR(L12=\"\",L12=0),OR(T12=\"\",T12=0),OR(U12=\"\",U12=0)),\"G\",\"\")","v":"G"},null,null,null,"4. Pārdošanas izmaksas.",null,60,null,null,null,null,null,null,"4. Pārdošanas izmaksas.",null,60]
[null,"R70",11,"G",null,null,null,"5. Administrācijas izmaksas.",null,70,null,null,null,null,null,null,"5. Administrācijas izmaksas.",null,70]
[null,"R80",11,"G",null,null,null,"6. Pārējie saimnieciskās darbības ieņēmumi.",null,80,null,null,null,null,null,null,"6. Pārējie saimnieciskās darbības ieņēmumi.",null,80]
[null,"R90",11,"G",null,null,null,"7. Pārējās saimnieciskās darbības izmaksas.",null,90,null,null,null,null,null,null,"7. Pārējās saimnieciskās darbības izmaksas.",null,90]
[null,null,null,"G",null,null,null,"8. Ieņēmumi no līdzdalības:",null,100,{"$f":"SUM(K17:K19)","v":0},{"$f":"SUM(L17:L19)","v":0},null,null,null,null,"8. Ieņēmumi no līdzdalības:",null,100,{"$f":"SUM(T17:T19)","v":0},{"$f":"SUM(U17:U19)","v":0}]
[null,"R110",11,"G",null,null,null,"   a) radniecīgo sabiedrību kapitālā",null,110,null,null,null,null,null,null,"a) radniecīgo sabiedrību kapitālā",null,110]
[null,"R120",11,"G",null,null,null,"   b) asociēto sabiedrību kapitālā",null,120,null,null,null,null,null,null,"b) asociēto sabiedrību kapitālā",null,120]
[null,"R130",11,"G",null,null,null,"   c) citu sabiedrību kapitālā",null,130,null,null,null,null,null,null,"c) citu sabiedrību kapitālā",null,130]
[null,null,null,"G",null,null,null,"9. Ieņēmumi no pārējiem vērtspapīriem un aizdevumiem, kas veidojuši ilgtermiņa finanšu ieguldījumus:",null,140,{"$f":"SUM(K21:K22)","v":0},{"$f":"SUM(L21:L22)","v":0},null,null,null,null,"9. Ieņēmumi no pārējiem vērtspapīriem un aizdevumiem, kas veidojuši ilgtermiņa finanšu ieguldījumus:",null,140,{"$f":"SUM(T21:T22)","v":0},{"$f":"SUM(U21:U22)","v":0}]
[null,"R150",11,"G",null,null,null,"   a) no radniecīgajām sabiedrībām",null,150,null,null,null,null,null,null,"a) no radniecīgajām sabiedrībām",null,150]
[null,"R160",11,"G",null,null,null,"   b) no asociētajām sabiedrībām un citām sabiedrībām, kā arī no vērtspapīriem un citiem ilgtermiņa debitoriem",null,160,null,null,null,null,null,null,"b) no asociētajām sabiedrībām un citām sabiedrībām, kā arī no vērtspapīriem un citiem ilgtermiņa debitoriem",null,160]
[null,null,null,"G",null,null,null,"10. Pārējie procentu ieņēmumi un tamlīdzīgi ieņēmumi:",null,170,{"$f":"SUM(K24:K25)","v":0},{"$f":"SUM(L24:L25)","v":0},null,null,null,null,"10. Pārējie procentu ieņēmumi un tamlīdzīgi ieņēmumi:",null,170,{"$f":"SUM(T24:T25)","v":0},{"$f":"SUM(U24:U25)","v":0}]
[null,"R180",11,"G",null,null,null,"   a) no radniecīgajām sabiedrībām",null,180,null,null,null,null,null,null,"a) no radniecīgajām sabiedrībām",null,180]
[null,"R190",{"$f":"COLUMN(K25)","v":11},"G",null,null,null,"   b) no citām personām",null,190,null,null,null,null,null,null,"b) no citām personām",null,190]
[null,{"$f":"\"R\"&J26","v":"R200"},{"$f":"COLUMN(K26)","v":11},{"$f":"IF(AND(OR(K26=\"\",K26=0),OR(L26=\"\",L26=0),OR(T26=\"\",T26=0),OR(U26=\"\",U26=0)),\"G\",\"\")","v":"G"},null,null,null,"11. Ilgtermiņa un īstermiņa finanšu ieguldījumu vērtības samazinājuma korekcijas.",null,{"$f":"IF(Pamatdati!$H$3<>\"Konsolidētais uzņēmuma gada pārskats\",J25+10,\"---\")","v":200},null,null,null,null,null,null,"11. Ilgtermiņa un īstermiņa finanšu ieguldījumu vērtības samazinājuma korekcijas.",null,{"$f":"J26","v":200}]
[null,{"$f":"IF(Pamatdati!$H$3=\"Konsolidētais uzņēmuma gada pārskats\",\"R---\",\"R\"&J27)","v":"R---"},11,"G",null,null,null,"11. Ilgtermiņa un īstermiņa finanšu ieguldījumu vērtības samazinājuma korekcijas.",null,{"$f":"IF(Pamatdati!$H$3=\"Konsolidētais uzņēmuma gada pārskats\",J25+10,\"---\")","v":"---"},{"$f":"SUM(K28:K29)","v":0},{"$f":"SUM(L28:L29)","v":0},null,null,null,null,"11. Ilgtermiņa un īstermiņa finanšu ieguldījumu vērtības samazinājuma korekcijas.",null,"---",{"$f":"SUM(T28:T29)","v":0},{"$f":"SUM(U28:U29)","v":0}]
[null,{"$f":"\"R\"&J28","v":"R---"},11,"G",null,null,null,"a) līdzdalības asociēto sabiedrību kapitālā vērtības samazināšanās,",null,{"$f":"IF(Pamatdati!$H$3=\"Konsolidētais uzņēmuma gada pārskats\",J27+10,\"---\")","v":"---"},null,null,null,null,null,null,"a) līdzdalības asociēto sabiedrību kapitālā vērtības samazināšanās,",null,"---"]
[null,"R---",11,"G",null,null,null,"b) pārējās vērtības samazinājuma korekcijas.",null,{"$f":"IF(Pamatdati!$H$3=\"Konsolidētais uzņēmuma gada pārskats\",J28+10,\"---\")","v":"---"},null,null,null,null,null,null,"b) pārējās vērtības samazinājuma korekcijas.",null,"---"]
[null,null,null,"G",null,null,null,"12. Procentu maksājumi un tamlīdzīgas izmaksas.",null,{"$f":"IF(Pamatdati!$H$3=\"Konsolidētais uzņēmuma gada pārskats\",J29+10,J26+10)","v":210},{"$f":"SUM(K31:K32)","v":0},{"$f":"SUM(L31:L32)","v":0},null,null,null,null,"12. Procentu maksājumi un tamlīdzīgas izmaksas.",null,210,{"$f":"SUM(T31:T32)","v":0},{"$f":"SUM(U31:U32)","v":0}]
[null,{"$f":"\"R\"&J31","v":"R220"},{"$f":"COLUMN(K31)","v":11},"G",null,null,null,"   a) radniecīgajām sabiedrībām",null,{"$f":"J30+10","v":220},null,null,null,null,null,null,"a) radniecīgajām sabiedrībām",null,220]
[null,"R230",11,"G",null,null,null,"   b) citām personām",null,230,null,null,null,null,null,null,"b) citām personām",null,230]
[null,null,null,null,null,null,null,"13. Peļņa vai zaudējumi pirms uzņēmumu ienākuma nodokļa",null,240,{"$f":"K11-K12-K13+K14-K15+K16+K20+K23-K30+K27+K26","v":0},{"$f":"L11-L12-L13+L14-L15+L16+L20+L23-L30+L27+L26","v":0},null,null,null,null,"13. Peļņa vai zaudējumi pirms uzņēmumu ienākuma nodokļa",null,240,{"$f":"T11-T12-T13+T14-T15+T16+T20+T23-T30+T27+T26","v":0},0]
[null,{"$f":"\"R\"&J34","v":"R250"},11,{"$f":"IF(AND(OR(K34=\"\",K34=0),OR(L34=\"\",L34=0),OR(T34=\"\",T34=0),OR(U34=\"\",U34=0)),\"G\",\"\")","v":"G"},null,null,null,"14. Uzņēmumu ienākuma nodoklis par pārskata gadu.",null,250,null,null,null,null,null,null,"14. Uzņēmumu ienākuma nodoklis par pārskata gadu.",null,250]
[null,null,null,null,null,null,null,"15. Peļņa vai zaudējumi pēc uzņēmumu ienākuma nodokļa aprēķināšanas",null,260,{"$f":"K33-K34","v":0},{"$f":"L33-L34","v":0},null,null,null,null,"15. Peļņa vai zaudējumi pēc uzņēmumu ienākuma nodokļa aprēķināšanas",null,260,{"$f":"T33-T34","v":0},{"$f":"U33-U34","v":0}]
[null,{"$f":"\"R\"&J36","v":"R270"},11,{"$f":"IF(AND(OR(K36=\"\",K36=0),OR(L36=\"\",L36=0),OR(T36=\"\",T36=0),OR(U36=\"\",U36=0)),\"G\",\"\")","v":"G"},null,null,null,"16. Ieņēmumi vai izmaksas no atliktā nodokļa aktīvu vai saistību atlikumu izmaiņām",null,270,null,null,null,null,null,null,"16. Ieņēmumi vai izmaksas no atliktā nodokļa aktīvu vai saistību atlikumu izmaiņām",null,270]
[null,"R280",11,{"$f":"IF(AND(OR(K37=\"\",K37=0),OR(L37=\"\",L37=0),OR(T37=\"\",T37=0),OR(U37=\"\",U37=0)),\"G\",\"\")","v":"G"},null,null,null,"17. Ārkārtas dividendes",null,280,null,null,null,null,null,null,"17. Ārkārtas dividendes",null,280]
[null,null,null,null,null,null,null,"18. Pārskata gada peļņa vai zaudējumi.",null,290,{"$f":"K35+K36-K37","v":0},{"$f":"L35+L36-L37","v":0},null,null,null,null,"18. Pārskata gada peļņa vai zaudējumi.",null,290,{"$f":"T35+T36-T37","v":0},{"$f":"U35+U36-U37","v":0}]
[null,{"$f":"\"R\"&J39","v":"R---"},{"$f":"COLUMN(K39)","v":11},{"$f":"IF(AND(OR(K39=\"\",K39=0),OR(L39=\"\",L39=0),OR(T39=\"\",T39=0),OR(U39=\"\",U39=0)),\"G\",\"\")","v":"G"},null,null,null,"19. Mazākumakcionāru peļņas vai zaudējumu daļa",null,{"$f":"IF(Pamatdati!H20=\"Konsolidētais uzņēmuma gada pārskats\",J38+10,\"---\")","v":"---"},null,null,null,null,null,null,"19. Mazākumakcionāru peļņas vai zaudējumu daļa",null,"---"]
[]
[null,null,null,null,null,null,null,null,null,null,{"$f":"K38-Pasīvi!K21","v":0},{"$f":"L38-Pasīvi!L21","v":0},null,null,null,null,null,null,null,{"$f":"T38-Pasīvi!T21","v":0},{"$f":"U38-Pasīvi!U21","v":0}]

{"sheet":"NPP1","index":6,"n_rows":38,"n_cols":21,"rows_kept":38,"cut":false,"hidden":true,"merged":[[32,16,32,17],[34,16,34,17],[35,16,35,17],[36,16,36,17],[37,16,37,17],[27,16,27,17],[28,16,28,17],[29,16,29,17],[30,16,30,17],[31,16,31,17],[21,16,21,17],[22,16,22,17],[23,16,23,17],[25,16,25,17],[26,16,26,17],[16,16,16,17],[17,16,17,17],[18,16,18,17],[19,16,19,17],[20,16,20,17],[10,16,10,17],[11,16,11,17],[12,16,12,17],[14,16,14,17],[15,16,15,17],[5,16,5,17],[6,16,6,17],[7,16,7,17],[8,16,8,17],[9,16,9,17],[10,7,10,8],[12,7,12,8],[11,7,11,8],[5,7,5,8],[6,7,6,8],[7,7,7,8],[8,7,8,8],[9,7,9,8],[37,7,37,8],[34,7,34,8],[35,7,35,8],[18,7,18,8],[19,7,19,8],[20,7,20,8],[14,7,14,8],[22,7,22,8],[36,7,36,8],[30,7,30,8],[31,7,31,8],[32,7,32,8],[25,7,25,8],[26,7,26,8],[27,7,27,8],[28,7,28,8],[29,7,29,8],[21,7,21,8],[23,7,23,8],[15,7,15,8],[16,7,16,8],[17,7,17,8]]}
[{"$f":"COLUMN(P1)-COLUMN(G1)","v":9},"xmlIdent","xmlClmn","xlGr"]
[]
[null,null,null,null,null,null,"Naudas plūsmas pārskats (NPP)  - NPP pēc tiešās metodes (NPP1)",null,null,null,null,null,null,{"$f":"IF(Pamatdati!$H$5=Pamatdati!$Q$5,IF(Pamatdati!$H$8-1=Pamatdati!$Q$9,\"IPG\",\"PG\"),\"N\")","v":"PG"},null,"Tikai salīdzināšanai"]
[]
[null,null,null,null,null,null,"Posteņa nosaukums",null,null,"Rindas kods","Pārskata\ngada beigās","Iepriekšējā\npārskata\ngada beigās",null,null,null,"Posteņa nosaukums",null,null,"Rindas kods","Pārskata\ngada beigās","Iepriekšējā\npārskata\ngada beigās"]
[null,null,null,null,null,null,null,"I. Pamatdarbības naudas plūsma",null,"10",null,null,null,null,null,null,"I. Pamatdarbības naudas plūsma",null,10]
[null,"R20",{"$f":"COLUMN(K7)","v":11},{"$f":"IF(AND(OR(K7=\"\",K7=0),OR(L7=\"\",L7=0),OR(T7=\"\",T7=0),OR(U7=\"\",U7=0)),\"G\",\"\")","v":"G"},null,null,null,"1. Ieņēmumi no preču pārdošanas un pakalpojumu sniegšanas.",null,"20",null,null,null,null,null,null,"1. Ieņēmumi no preču pārdošanas un pakalpojumu sniegšanas.",null,20]
[null,"R30",11,"G",null,null,null,"2. Maksājumi piegādātājiem, darbiniekiem, pārējiem pamatdarbības izdevumiem.",null,"30",null,null,null,null,null,null,"2. Maksājumi piegādātājiem, darbiniekiem, pārējiem pamatdarbības izdevumiem.",null,30]
[null,"R40",11,"G",null,null,null,"3. Pārējie pamatdarbības ieņēmumi vai izdevumi.",null,"40",null,null,null,null,null,null,"3. Pārējie pamatdarbības ieņēmumi vai izdevumi.",null,40]
[null,"R50",11,"G",null,null,null,"4. Bruto pamatdarbības naudas plūsma.",null,"50",null,null,null,null,null,null,"4. Bruto pamatdarbības naudas plūsma.",null,50]
[null,"R60",11,"G",null,null,null,"5. Izdevumi procentu maksājumiem.",null,"60",null,null,null,null,null,null,"5. Izdevumi procentu maksājumiem.",null,60]
[null,"R70",11,"G",null,null,null,"6. Izdevumi uzņēmumu ienākuma nodokļa maksājumiem.",null,"70",null,null,null,null,null,null,"6. Izdevumi uzņēmumu ienākuma nodokļa maksājumiem.",null,70]
[null,"R80",11,"G",null,null,null,"7. Pamatdarbības neto naudas plūsma.",null,"80",null,null,null,null,null,null,"7. Pamatdarbības neto naudas plūsma.",null,80]
[null,null,null,null,null,null,null,null,null,"",null,null,null,null,null,null,null,null,""]
[null,null,null,null,null,null,null,"II. Ieguldīšanas darbības naudas plūsma",null,"90",null,null,null,null,null,null,"II. Ieguldīšanas darbības naudas plūsma",null,90]
[null,"R100",{"$f":"COLUMN(K16)","v":11},{"$f":"IF(AND(OR(K16=\"\",K16=0),OR(L16=\"\",L16=0),OR(T16=\"\",T16=0),OR(U16=\"\",U16=0)),\"G\",\"\")","v":"G"},null,null,null,"1. Radniecīgo sabiedrību, asociēto sabiedrību vai citu sabiedrību akciju vai daļu iegāde.",null,"100",null,null,null,null,null,null,"1. Radniecīgo sabiedrību, asociēto sabiedrību vai citu sabiedrību akciju vai daļu iegāde.",null,100]
[null,"R110",11,"G",null,null,null,"2. Ieņēmumi no radniecīgo sabiedrību, asociēto sabiedrību vai citu sabiedrību akciju vai daļu atsavināšanas.",null,"110",null,null,null,null,null,null,"2. Ieņēmumi no radniecīgo sabiedrību, asociēto sabiedrību vai citu sabiedrību akciju vai daļu atsavināšanas.",null,110]
[null,"R120",11,"G",null,null,null,"3. Pamatlīdzekļu un nemateriālo ieguldījumu iegāde.",null,"120",null,null,null,null,null,null,"3. Pamatlīdzekļu un nemateriālo ieguldījumu iegāde.",null,120]
[null,"R130",11,"G",null,null,null,"4. Ieņēmumi no pamatlīdzekļu un nemateriālo ieguldījumu pārdošanas.",null,"130",null,null,null,null,null,null,"4. Ieņēmumi no pamatlīdzekļu un nemateriālo ieguldījumu pārdošanas.",null,130]
[null,"R140",11,"G",null,null,null,"5. Izsniegtie aizdevumi.",null,"140",null,null,null,null,null,null,"5. Izsniegtie aizdevumi.",null,140]
[null,"R150",11,"G",null,null,null,"6. Ieņēmumi no aizdevumu atmaksas.",null,"150",null,null,null,null,null,null,"6. Ieņēmumi no aizdevumu atmaksas.",null,150]
[null,"R160",11,"G",null,null,null,"7. Saņemtie procenti.",null,"160",null,null,null,null,null,null,"7. Saņemtie procenti.",null,160]
[null,"R170",11,"G",null,null,null,"8. Saņemtās dividendes.",null,"170",null,null,null,null,null,null,"8. Saņemtās dividendes.",null,170]
[null,"R180",11,"G",null,null,null,"9. Ieguldīšanas darbības neto naudas plūsma.",null,"180",null,null,null,null,null,null,"9. Ieguldīšanas darbības neto naudas plūsma.",null,180]
[null,null,null,null,null,null,null,null,null,"",null,null,null,null,null,null,null,null,""]
[null,null,null,null,null,null,null,"III. Finansēšanas darbības naudas plūsma",null,"190",null,null,null,null,null,null,"III. Finansēšanas darbības naudas plūsma",null,190]
[null,"R200",{"$f":"COLUMN(K27)","v":11},{"$f":"IF(AND(OR(K27=\"\",K27=0),OR(L27=\"\",L27=0),OR(T27=\"\",T27=0),OR(U27=\"\",U27=0)),\"G\",\"\")","v":"G"},null,null,null,"1. Ieņēmumi no akciju un obligāciju emisijas vai kapitāla līdzdalības daļu ieguldījumiem.",null,"200",null,null,null,null,null,null,"1. Ieņēmumi no akciju un obligāciju emisijas vai kapitāla līdzdalības daļu ieguldījumiem.",null,200]
[null,"R210",11,"G",null,null,null,"2. Saņemtie aizņēmumi.",null,"210",null,null,null,null,null,null,"2. Saņemtie aizņēmumi.",null,210]
[null,"R220",11,"G",null,null,null,"3. Saņemtās subsīdijas, dotācijas, dāvinājumi vai ziedojumi.",null,"220",null,null,null,null,null,null,"3. Saņemtās subsīdijas, dotācijas, dāvinājumi vai ziedojumi.",null,220]
[null,"R230",11,"G",null,null,null,"4. Izdevumi aizņēmumu atmaksāšanai.",null,"230",null,null,null,null,null,null,"4. Izdevumi aizņēmumu atmaksāšanai.",null,230]
[null,"R240",11,"G",null,null,null,"5. Izdevumi nomāta pamatlīdzekļa izpirkumam.",null,"240",null,null,null,null,null,null,"5. Izdevumi nomāta pamatlīdzekļa izpirkumam.",null,240]
[null,"R250",11,"G",null,null,null,"6. Izmaksātās dividendes.",null,"250",null,null,null,null,null,null,"6. Izmaksātās dividendes.",null,250]
[null,"R260",11,"G",null,null,null,"7. Finansēšanas darbības neto naudas plūsma.",null,"260",null,null,null,null,null,null,"7. Finansēšanas darbības neto naudas plūsma.",null,260]
[null,null,null,null,null,null,null,null,null,"",null,null,null,null,null,null,null,null,""]
[null,"R270",{"$f":"COLUMN(K35)","v":11},{"$f":"IF(AND(OR(K35=\"\",K35=0),OR(L35=\"\",L35=0),OR(T35=\"\",T35=0),OR(U35=\"\",U35=0)),\"G\",\"\")","v":"G"},null,null,null,"IV. Ārvalstu valūtu kursu svārstību rezultāts",null,"270",null,null,null,null,null,null,"IV. Ārvalstu valūtu kursu svārstību rezultāts",null,270]
[null,"R280",11,{"$f":"IF(AND(OR(K36=\"\",K36=0),OR(L36=\"\",L36=0),OR(T36=\"\",T36=0),OR(U36=\"\",U36=0)),\"G\",\"\")","v":"G"},null,null,null,"V. Naudas un tās ekvivalentu neto pieaugums vai samazinājums",null,"280",null,null,null,null,null,null,"V. Naudas un tās ekvivalentu neto pieaugums vai samazinājums",null,280]
[null,"R290",11,{"$f":"IF(AND(OR(K37=\"\",K37=0),OR(L37=\"\",L37=0),OR(T37=\"\",T37=0),OR(U37=\"\",U37=0)),\"G\",\"\")","v":"G"},null,null,null,"VI. Naudas un tās ekvivalentu atlikums pārskata gada sākumā",null,"290",null,null,null,null,null,null,"VI. Naudas un tās ekvivalentu atlikums pārskata gada sākumā",null,290]
[null,"R300",11,{"$f":"IF(AND(OR(K38=\"\",K38=0),OR(L38=\"\",L38=0),OR(T38=\"\",T38=0),OR(U38=\"\",U38=0)),\"G\",\"\")","v":"G"},null,null,null,"VII. Naudas un tās ekvivalentu atlikums pārskata gada beigās",null,"300",null,null,null,null,null,null,"VII. Naudas un tās ekvivalentu atlikums pārskata gada beigās",null,300]

{"sheet":"NPP2","index":7,"n_rows":53,"n_cols":21,"rows_kept":53,"cut":false,"hidden":true,"merged":[[50,16,50,17],[51,16,51,17],[52,16,52,17],[44,16,44,17],[45,16,45,17],[46,16,46,17],[47,16,47,17],[49,16,49,17],[38,16,38,17],[40,16,40,17],[41,16,41,17],[42,16,42,17],[43,16,43,17],[33,16,33,17],[34,16,34,17],[35,16,35,17],[36,16,36,17],[37,16,37,17],[27,16,27,17],[29,16,29,17],[30,16,30,17],[31,16,31,17],[32,16,32,17],[21,16,21,17],[22,16,22,17],[24,16,24,17],[25,16,25,17],[26,16,26,17],[15,16,15,17],[16,16,16,17],[18,16,18,17],[19,16,19,17],[20,16,20,17],[10,16,10,17],[11,16,11,17],[12,16,12,17],[13,16,13,17],[14,16,14,17],[5,16,5,17],[6,16,6,17],[7,16,7,17],[8,16,8,17],[9,16,9,17],[52,7,52,8],[50,7,50,8],[51,7,51,8],[49,7,49,8],[44,7,44,8],[45,7,45,8],[46,7,46,8],[47,7,47,8],[40,7,40,8],[41,7,41,8],[42,7,42,8],[43,7,43,8],[13,7,13,8],[14,7,14,8],[32,7,32,8],[24,7,24,8],[26,7,26,8],[25,7,25,8],[21,7,21,8],[22,7,22,8],[12,7,12,8],[38,7,38,8],[27,7,27,8],[29,7,29,8],[30,7,30,8],[31,7,31,8],[33,7,33,8],[34,7,34,8],[35,7,35,8],[36,7,36,8],[37,7,37,8],[15,7,15,8],[16,7,16,8],[18,7,18,8],[19,7,19,8],[20,7,20,8],[5,7,5,8],[8,7,8,8],[9,7,9,8],[10,7,10,8],[11,7,11,8],[6,7,6,8],[7,7,7,8]]}
[{"$f":"COLUMN(P1)-COLUMN(G1)","v":9},"xmlIdent","xmlClmn","xlGr"]
[]
[null,null,null,null,null,null,"Naudas plūsmas pārskats (NPP)  - NPP pēc netiešās metodes (NPP2)",null,null,null,null,null,null,{"$f":"IF(Pamatdati!$H$5=Pamatdati!$Q$5,IF(Pamatdati!$H$8-1=Pamatdati!$Q$9,\"IPG\",\"PG\"),\"N\")","v":"PG"},null,"Tikai salīdzināšanai"]
[]
[null,null,null,null,null,null,"Posteņa nosaukums",null,null,"Rindas kods","Pārskata\ngada beigās","Iepriekšējā\npārskata\ngada beigās",null,null,null,"Posteņa nosaukums",null,null,"Rindas kods","Pārskata\ngada beigās","Iepriekšējā\npārskata\ngada beigās"]
[null,null,null,null,null,null,null,"I. Pamatdarbības naudas plūsma",null,"10",null,null,null,null,null,null,"I. Pamatdarbības naudas plūsma",null,10]
[null,"R20",{"$f":"COLUMN(K7)","v":11},null,null,null,null,"1. Peļņa vai zaudējumi pirms uzņēmumu ienākuma nodokļa.",null,"20",null,null,null,null,null,null,"1. Peļņa vai zaudējumi pirms uzņēmumu ienākuma nodokļa.",null,20]
[null,null,null,null,null,null,null,"Korekcijas:",null,"30",null,null,null,null,null,null,"Korekcijas:",null,30]
[null,"R40",{"$f":"COLUMN(K9)","v":11},{"$f":"IF(AND(OR(K9=\"\",K9=0),OR(L9=\"\",L9=0),OR(T9=\"\",T9=0),OR(U9=\"\",U9=0)),\"G\",\"\")","v":"G"},null,null,null,"a) pamatlīdzekļu vērtības samazinājuma korekcijas;",null,"40",null,null,null,null,null,null,"a) pamatlīdzekļu vērtības samazinājuma korekcijas;",null,40]
[null,"R50",11,"G",null,null,null,"b) nemateriālo ieguldījumu vērtības samazinājuma korekcijas;",null,"50",null,null,null,null,null,null,"b) nemateriālo ieguldījumu vērtības samazinājuma korekcijas;",null,50]
[null,"R60",11,"G",null,null,null,"c) uzkrājumu veidošana (izņemot uzkrājumus nedrošiem parādiem);",null,"60",null,null,null,null,null,null,"c) uzkrājumu veidošana (izņemot uzkrājumus nedrošiem parādiem);",null,60]
[null,"R70",11,"G",null,null,null,"d) peļņa vai zaudējumi no ārvalstu valūtu kursu svārstībām;",null,"70",null,null,null,null,null,null,"d) peļņa vai zaudējumi no ārvalstu valūtu kursu svārstībām;",null,70]
[null,"R80",11,"G",null,null,null,"e) ieņēmumi no līdzdalības radniecīgo sabiedrību, asociēto sabiedrību vai citu sabiedrību pamatkapitālā",null,"80",null,null,null,null,null,null,"e) ieņēmumi no līdzdalības radniecīgo sabiedrību, asociēto sabiedrību vai citu sabiedrību pamatkapitālā",null,80]
[null,"R90",11,"G",null,null,null,"f) ieņēmumi no pārējiem vērtspapīriem un aizdevumiem, kas veidojuši ilgtermiņa finanšu ieguldījumus",null,"90",null,null,null,null,null,null,"f) ieņēmumi no pārējiem vērtspapīriem un aizdevumiem, kas veidojuši ilgtermiņa finanšu ieguldījumus",null,90]
[null,"R100",11,"G",null,null,null,"g) pārējie procentu ieņēmumi un tamlīdzīgi ieņēmumi;",null,"100",null,null,null,null,null,null,"g) pārējie procentu ieņēmumi un tamlīdzīgi ieņēmumi;",null,100]
[null,"R110",11,"G",null,null,null,"h) ilgtermiņa un īstermiņa finanšu ieguldījumu vērtības samazinājuma korekcijas;",null,"110",null,null,null,null,null,null,"h) ilgtermiņa un īstermiņa finanšu ieguldījumu vērtības samazinājuma korekcijas;",null,110]
[null,"R120",11,"G",null,null,null,"i) procentu maksājumi un tamlīdzīgas izmaksas.",null,"120",null,null,null,null,null,null,"i) procentu maksājumi un tamlīdzīgas izmaksas.",null,120]
[]
[null,"R130",{"$f":"COLUMN(K19)","v":11},null,null,null,null,"2. Peļņa vai zaudējumi pirms apgrozāmo līdzekļu un īstermiņa kreditoru atlikumu izmaiņu ietekmes korekcijām.",null,"130",{"$f":"SUM(K7:K17)","v":0},{"$f":"SUM(L7:L17)","v":0},null,null,null,null,"2. Peļņa vai zaudējumi pirms apgrozāmo līdzekļu un īstermiņa kreditoru atlikumu izmaiņu ietekmes korekcijām.",null,"130",{"$f":"SUM(T7:T17)","v":0},{"$f":"SUM(U7:U17)","v":0}]
[null,null,null,null,null,null,null,"Korekcijas:",null,"140",null,null,null,null,null,null,"Korekcijas:",null,140]
[null,"R150",{"$f":"COLUMN(K21)","v":11},{"$f":"IF(AND(OR(K21=\"\",K21=0),OR(L21=\"\",L21=0),OR(T21=\"\",T21=0),OR(U21=\"\",U21=0)),\"G\",\"\")","v":"G"},null,null,null,"a) debitoru parādu atlikumu pieaugums vai samazinājums;",null,"150",null,null,null,null,null,null,"a) debitoru parādu atlikumu pieaugums vai samazinājums;",null,150]
[null,"R160",11,{"$f":"IF(AND(OR(K22=\"\",K22=0),OR(L22=\"\",L22=0),OR(T22=\"\",T22=0),OR(U22=\"\",U22=0)),\"G\",\"\")","v":"G"},null,null,null,"b) krājumu atlikumu pieaugums vai samazinājums;",null,"160",null,null,null,null,null,null,"b) krājumu atlikumu pieaugums vai samazinājums;",null,160]
[null,"R170",11,{"$f":"IF(AND(OR(K23=\"\",K23=0),OR(L23=\"\",L23=0),OR(T23=\"\",T23=0),OR(U23=\"\",U23=0)),\"G\",\"\")","v":"G"},null,null,null,"c) piegādātājiem, darbuzņēmējiem un pārējiem kreditoriem maksājamo parādu atlikumu pieaugums vai samazinājums.",null,"170",null,null,null,null,null,null,"c) piegādātājiem, darbuzņēmējiem un pārējiem kreditoriem maksājamo parādu atlikumu pieaugums vai samazinājums.",null,170]
[]
[null,"R180",{"$f":"COLUMN(K25)","v":11},{"$f":"IF(AND(OR(K25=\"\",K25=0),OR(L25=\"\",L25=0),OR(T25=\"\",T25=0),OR(U25=\"\",U25=0)),\"G\",\"\")","v":"G"},null,null,null,"3. Bruto pamatdarbības naudas plūsma.",null,"180",{"$f":"SUM(K19:K23)","v":0},{"$f":"SUM(L19:L23)","v":0},null,null,null,null,"3. Bruto pamatdarbības naudas plūsma.",null,"180",{"$f":"SUM(T19:T23)","v":0},{"$f":"SUM(U19:U23)","v":0}]
[null,"R190",11,{"$f":"IF(AND(OR(K26=\"\",K26=0),OR(L26=\"\",L26=0),OR(T26=\"\",T26=0),OR(U26=\"\",U26=0)),\"G\",\"\")","v":"G"},null,null,null,"4. Izdevumi procentu maksājumiem.",null,"190",null,null,null,null,null,null,"4. Izdevumi procentu maksājumiem.",null,190]
[null,"R200",11,{"$f":"IF(AND(OR(K27=\"\",K27=0),OR(L27=\"\",L27=0),OR(T27=\"\",T27=0),OR(U27=\"\",U27=0)),\"G\",\"\")","v":"G"},null,null,null,"5. Izdevumi uzņēmumu ienākuma nodokļa maksājumiem.",null,"200",null,null,null,null,null,null,"5. Izdevumi uzņēmumu ienākuma nodokļa maksājumiem.",null,200]
[null,"R210",11,{"$f":"IF(AND(OR(K28=\"\",K28=0),OR(L28=\"\",L28=0),OR(T28=\"\",T28=0),OR(U28=\"\",U28=0)),\"G\",\"\")","v":"G"},null,null,null,"6. Pamatdarbības neto naudas plūsma.",null,"210",{"$f":"SUM(K25:K27)","v":0},{"$f":"SUM(L25:L27)","v":0},null,null,null,null,"6. Pamatdarbības neto naudas plūsma.",null,"210",{"$f":"SUM(T25:T27)","v":0},{"$f":"SUM(U25:U27)","v":0}]
[]
[null,null,null,null,null,null,null,"II. Ieguldīšanas darbības naudas plūsma",null,"220",null,null,null,null,null,null,"II. Ieguldīšanas darbības naudas plūsma",null,220]
[null,"R230",{"$f":"COLUMN(K31)","v":11},{"$f":"IF(AND(OR(K31=\"\",K31=0),OR(L31=\"\",L31=0),OR(T31=\"\",T31=0),OR(U31=\"\",U31=0)),\"G\",\"\")","v":"G"},null,null,null,"1. Radniecīgo sabiedrību, asociēto sabiedrību vai citu sabiedrību akciju vai daļu iegāde.",null,"230",null,null,null,null,null,null,"1. Radniecīgo sabiedrību, asociēto sabiedrību vai citu sabiedrību akciju vai daļu iegāde.",null,230]
[null,"R240",11,"G",null,null,null,"2. Ieņēmumi no radniecīgo sabiedrību, asociēto sabiedrību vai citu sabiedrību akciju vai daļu atsavināšanas.",null,"240",null,null,null,null,null,null,"2. Ieņēmumi no radniecīgo sabiedrību, asociēto sabiedrību vai citu sabiedrību akciju vai daļu atsavināšanas.",null,240]
[null,"R250",11,"G",null,null,null,"3. Pamatlīdzekļu un nemateriālo ieguldījumu iegāde.",null,"250",null,null,null,null,null,null,"3. Pamatlīdzekļu un nemateriālo ieguldījumu iegāde.",null,250]
[null,"R260",11,"G",null,null,null,"4. Ieņēmumi no pamatlīdzekļu un nemateriālo ieguldījumu pārdošanas.",null,"260",null,null,null,null,null,null,"4. Ieņēmumi no pamatlīdzekļu un nemateriālo ieguldījumu pārdošanas.",null,260]
[null,"R270",11,"G",null,null,null,"5. Izsniegtie aizdevumi.",null,"270",null,null,null,null,null,null,"5. Izsniegtie aizdevumi.",null,270]
[null,"R280",11,"G",null,null,null,"6. Ieņēmumi no aizdevumu atmaksas.",null,"280",null,null,null,null,null,null,"6. Ieņēmumi no aizdevumu atmaksas.",null,280]
[null,"R290",11,"G",null,null,null,"7. Saņemtie procenti.",null,"290",null,null,null,null,null,null,"7. Saņemtie procenti.",null,290]
[null,"R300",11,"G",null,null,null,"8. Saņemtās dividendes.",null,"300",null,null,null,null,null,null,"8. Saņemtās dividendes.",null,300]
[null,"R310",11,"G",null,null,null,"9. Ieguldīšanas darbības neto naudas plūsma.",null,"310",{"$f":"SUM(K31:K38)","v":0},{"$f":"SUM(L31:L38)","v":0},null,null,null,null,"9. Ieguldīšanas darbības neto naudas plūsma.",null,"310",{"$f":"SUM(T31:T38)","v":0},0]
[]
[null,null,null,null,null,null,null,"III. Finansēšanas darbības naudas plūsma",null,"320",null,null,null,null,null,null,"III. Finansēšanas darbības naudas plūsma",null,320]
[null,"R330",{"$f":"COLUMN(K42)","v":11},{"$f":"IF(AND(OR(K42=\"\",K42=0),OR(L42=\"\",L42=0),OR(T42=\"\",T42=0),OR(U42=\"\",U42=0)),\"G\",\"\")","v":"G"},null,null,null,"1. Ieņēmumi no akciju un obligāciju emisijas vai kapitāla līdzdalības daļu ieguldījumiem.",null,"330",null,null,null,null,null,null,"1. Ieņēmumi no akciju un obligāciju emisijas vai kapitāla līdzdalības daļu ieguldījumiem.",null,330]
[null,"R340",11,"G",null,null,null,"2. Saņemtie aizņēmumi.",null,"340",null,null,null,null,null,null,"2. Saņemtie aizņēmumi.",null,340]
[null,"R350",11,"G",null,null,null,"3. Saņemtās subsīdijas, dotācijas, dāvinājumi vai ziedojumi.",null,"350",null,null,null,null,null,null,"3. Saņemtās subsīdijas, dotācijas, dāvinājumi vai ziedojumi.",null,350]
[null,"R360",11,"G",null,null,null,"4. Izdevumi aizņēmumu atmaksāšanai.",null,"360",null,null,null,null,null,null,"4. Izdevumi aizņēmumu atmaksāšanai.",null,360]
[null,"R370",11,"G",null,null,null,"5. Izdevumi nomāta pamatlīdzekļa izpirkumam.",null,"370",null,null,null,null,null,null,"5. Izdevumi nomāta pamatlīdzekļa izpirkumam.",null,370]
[null,"R380",11,"G",null,null,null,"6. Izmaksātās dividendes.",null,"380",null,null,null,null,null,null,"6. Izmaksātās dividendes.",null,380]
[null,"R390",11,"G",null,null,null,"7. Finansēšanas darbības neto naudas plūsma.",null,"390",{"$f":"SUM(K42:K47)","v":0},{"$f":"SUM(L42:L47)","v":0},null,null,null,null,"7. Finansēšanas darbības neto naudas plūsma.",null,"390",{"$f":"SUM(T42:T47)","v":0},0]
[]
[null,"R400",{"$f":"COLUMN(K50)","v":11},{"$f":"IF(AND(OR(K50=\"\",K50=0),OR(L50=\"\",L50=0),OR(T50=\"\",T50=0),OR(U50=\"\",U50=0)),\"G\",\"\")","v":"G"},null,null,null,"IV. Ārvalstu valūtu kursu svārstību rezultāts",null,"400",null,null,null,null,null,null,"IV. Ārvalstu valūtu kursu svārstību rezultāts",null,400]
[null,"R410",11,{"$f":"IF(AND(OR(K51=\"\",K51=0),OR(L51=\"\",L51=0),OR(T51=\"\",T51=0),OR(U51=\"\",U51=0)),\"G\",\"\")","v":"G"},null,null,null,"V. Pārskata gada neto naudas plūsma",null,"410",{"$f":"SUM(K28,K39,K48,K50)","v":0},{"$f":"SUM(L28,L39,L48,L50)","v":0},null,null,null,null,"V. Pārskata gada neto naudas plūsma",null,"410",{"$f":"SUM(T28,T39,T48,T50)","v":0},0]
[null,"R420",11,{"$f":"IF(AND(OR(K52=\"\",K52=0),OR(L52=\"\",L52=0),OR(T52=\"\",T52=0),OR(U52=\"\",U52=0)),\"G\",\"\")","v":"G"},null,null,null,"VI. Naudas un tās ekvivalentu atlikums pārskata gada sākumā",null,"420",null,null,null,null,null,null,"VI. Naudas un tās ekvivalentu atlikums pārskata gada sākumā",null,420]
[null,"R430",11,{"$f":"IF(AND(OR(K53=\"\",K53=0),OR(L53=\"\",L53=0),OR(T53=\"\",T53=0),OR(U53=\"\",U53=0)),\"G\",\"\")","v":"G"},null,null,null,"VII. Naudas un tās ekvivalentu atlikums pārskata gada beigās",null,"430",{"$f":"SUM(K51:K52)","v":0},{"$f":"SUM(L51:L52)","v":0},null,null,null,null,"VII. Naudas un tās ekvivalentu atlikums pārskata gada beigās",null,"430",{"$f":"SUM(T51:T52)","v":0},{"$f":"SUM(U51:U52)","v":0}]

{"sheet":"PKIP","index":8,"n_rows":51,"n_cols":21,"rows_kept":51,"cut":false,"hidden":true,"merged":[[49,16,49,17],[50,16,50,17],[36,16,36,17],[37,16,37,17],[38,16,38,17],[39,16,39,17],[48,16,48,17],[42,16,42,17],[43,16,43,17],[44,16,44,17],[45,16,45,17],[27,16,27,17],[30,16,30,17],[31,16,31,17],[32,16,32,17],[33,16,33,17],[20,16,20,17],[21,16,21,17],[24,16,24,17],[25,16,25,17],[26,16,26,17],[13,16,13,17],[14,16,14,17],[15,16,15,17],[18,16,18,17],[19,16,19,17],[6,16,6,17],[7,16,7,17],[8,16,8,17],[9,16,9,17],[12,16,12,17],[50,7,50,8],[32,7,32,8],[33,7,33,8],[36,7,36,8],[37,7,37,8],[38,7,38,8],[49,7,49,8],[43,7,43,8],[44,7,44,8],[45,7,45,8],[13,7,13,8],[14,7,14,8],[15,7,15,8],[48,7,48,8],[18,7,18,8],[19,7,19,8],[20,7,20,8],[21,7,21,8],[24,7,24,8],[25,7,25,8],[26,7,26,8],[27,7,27,8],[30,7,30,8],[31,7,31,8],[39,7,39,8],[42,7,42,8],[9,7,9,8],[6,7,6,8],[7,7,7,8],[8,7,8,8],[12,7,12,8]]}
[{"$f":"COLUMN(P1)-COLUMN(G1)","v":9},"xmlIdent","xmlClmn","xlGr"]
[]
[null,null,null,null,null,null,"Pašu kapitāla izmaiņu pārskats (PKIP)",null,null,null,null,null,null,{"$f":"IF(Pamatdati!$H$5=Pamatdati!$Q$5,IF(Pamatdati!$H$8-1=Pamatdati!$Q$9,\"IPG\",\"PG\"),\"N\")","v":"PG"},null,"Tikai salīdzināšanai"]
[]
[null,null,null,null,null,null,"Posteņa nosaukums",null,null,"Rindas kods","Pārskata\ngada beigās","Iepriekšējā\npārskata\ngada beigās",null,null,null,"Posteņa nosaukums",null,null,"Rindas kods","Pārskata\ngada beigās","Iepriekšējā\npārskata\ngada beigās"]
[null,null,null,null,null,null,"I. Akciju vai daļu kapitāls (pamatkapitāls)",null,null,"10",null,null,null,null,null,"I. Akciju vai daļu kapitāls (pamatkapitāls)",null,null,10]
[null,"R20",{"$f":"COLUMN(K7)","v":11},null,null,null,null,"1. Iepriekšējā gada bilancē norādītā summa",null,"20",null,null,null,null,null,null,"1. Iepriekšējā gada bilancē norādītā summa",null,20]
[null,"R30",11,null,null,null,null,"2. Iepriekšējā gada bilancē norādītās summas labojums",null,"30",null,null,null,null,null,null,"2. Iepriekšējā gada bilancē norādītās summas labojums",null,30]
[null,"R40",11,{"$f":"IF(AND(OR(K9=\"\",K9=0),OR(L9=\"\",L9=0),OR(T9=\"\",T9=0),OR(U9=\"\",U9=0)),\"G\",\"\")","v":"G"},null,null,null,"3. Akciju vai daļu kapitāla (pamatkapitāla) pieaugums/samazinājums",null,"40",null,null,null,null,null,null,"3. Akciju vai daļu kapitāla (pamatkapitāla) pieaugums/samazinājums",null,40]
[null,null,null,null,null,null,null,"4. Pārskata gada bilancē norādītā summa perioda beigās",null,"50",{"$f":"SUM(K7:K9)","v":0},{"$f":"SUM(L7:L9)","v":0},null,null,null,null,"4. Pārskata gada bilancē norādītā summa perioda beigās",null,50,{"$f":"SUM(T7:T9)","v":0},{"$f":"SUM(U7:U9)","v":0}]
[]
[null,null,null,{"$f":"D16","v":"G"},null,null,"II. Akciju (daļu) emisijas uzcenojums",null,null,"60",null,null,null,null,null,"II. Akciju (daļu) emisijas uzcenojums",null,null,60]
[null,"R70",{"$f":"COLUMN(K13)","v":11},{"$f":"IF(AND(OR(K13=\"\",K13=0),OR(L13=\"\",L13=0),OR(T13=\"\",T13=0),OR(U13=\"\",U13=0)),\"G\",\"\")","v":"G"},null,null,null,"1. Iepriekšējā gada bilancē norādītā summa",null,"70",null,null,null,null,null,null,"1. Iepriekšējā gada bilancē norādītā summa",null,70]
[null,"R80",11,{"$f":"IF(AND(OR(K14=\"\",K14=0),OR(L14=\"\",L14=0),OR(T14=\"\",T14=0),OR(U14=\"\",U14=0)),\"G\",\"\")","v":"G"},null,null,null,"2. Iepriekšējā gada bilancē norādītās summas labojums",null,"80",null,null,null,null,null,null,"2. Iepriekšējā gada bilancē norādītās summas labojums",null,80]
[null,"R90",11,{"$f":"IF(AND(OR(K15=\"\",K15=0),OR(L15=\"\",L15=0),OR(T15=\"\",T15=0),OR(U15=\"\",U15=0)),\"G\",\"\")","v":"G"},null,null,null,"3. Akciju (daļu) emisijas uzcenojuma pieaugums/ samazinājums",null,"90",null,null,null,null,null,null,"3. Akciju (daļu) emisijas uzcenojuma pieaugums/ samazinājums",null,90]
[null,null,null,{"$f":"IF(AND(OR(K16=\"\",K16=0),OR(L16=\"\",L16=0),OR(T16=\"\",T16=0),OR(U16=\"\",U16=0)),\"G\",\"\")","v":"G"},null,null,null,"4. Pārskata gada bilancē norādītā summa perioda beigās",null,"100",{"$f":"SUM(K13:K15)","v":0},{"$f":"SUM(L13:L15)","v":0},null,null,null,null,"4. Pārskata gada bilancē norādītā summa perioda beigās",null,100,{"$f":"SUM(T13:T15)","v":0},{"$f":"SUM(U13:U15)","v":0}]
[null,null,null,{"$f":"D16","v":"G"}]
[null,null,null,{"$f":"D22","v":"G"},null,null,"III. Ilgtermiņa ieguldījumu pārvērtēšanas rezerve",null,null,"110",null,null,null,null,null,"III. Ilgtermiņa ieguldījumu pārvērtēšanas rezerve",null,null,110]
[null,"R120",{"$f":"COLUMN(K19)","v":11},{"$f":"IF(AND(OR(K19=\"\",K19=0),OR(L19=\"\",L19=0),OR(T19=\"\",T19=0),OR(U19=\"\",U19=0)),\"G\",\"\")","v":"G"},null,null,null,"1. Iepriekšējā gada bilancē norādītā summa",null,"120",null,null,null,null,null,null,"1. Iepriekšējā gada bilancē norādītā summa",null,120]
[null,"R130",11,{"$f":"IF(AND(OR(K20=\"\",K20=0),OR(L20=\"\",L20=0),OR(T20=\"\",T20=0),OR(U20=\"\",U20=0)),\"G\",\"\")","v":"G"},null,null,null,"2. Iepriekšējā gada bilancē norādītās summas labojums",null,"130",null,null,null,null,null,null,"2. Iepriekšējā gada bilancē norādītās summas labojums",null,130]
[null,"R140",11,{"$f":"IF(AND(OR(K21=\"\",K21=0),OR(L21=\"\",L21=0),OR(T21=\"\",T21=0),OR(U21=\"\",U21=0)),\"G\",\"\")","v":"G"},null,null,null,"3. Ilgtermiņa ieguldījumu pārvērtēšanas rezerves atlikuma palielinājums/samazinājums",null,"140",null,null,null,null,null,null,"3. Ilgtermiņa ieguldījumu pārvērtēšanas rezerves atlikuma palielinājums/samazinājums",null,140]
[null,null,null,{"$f":"IF(AND(OR(K22=\"\",K22=0),OR(L22=\"\",L22=0),OR(T22=\"\",T22=0),OR(U22=\"\",U22=0)),\"G\",\"\")","v":"G"},null,null,null,"4. Pārskata gada bilancē norādītā summa perioda beigās",null,"150",{"$f":"SUM(K19:K21)","v":0},{"$f":"SUM(L19:L21)","v":0},null,null,null,null,"4. Pārskata gada bilancē norādītā summa perioda beigās",null,150,{"$f":"SUM(T19:T21)","v":0},{"$f":"SUM(U19:U21)","v":0}]
[null,null,null,{"$f":"D22","v":"G"}]
[null,null,null,{"$f":"D28","v":"G"},null,null,"IV. Finanšu instrumentu patiesās vērtības rezerve",null,null,"160",null,null,null,null,null,"IV. Finanšu instrumentu patiesās vērtības rezerve",null,null,160]
[null,"R170",{"$f":"COLUMN(K25)","v":11},{"$f":"IF(AND(OR(K25=\"\",K25=0),OR(L25=\"\",L25=0),OR(T25=\"\",T25=0),OR(U25=\"\",U25=0)),\"G\",\"\")","v":"G"},null,null,null,"1. Iepriekšējā gada bilancē norādītā summa",null,"170",null,null,null,null,null,null,"1. Iepriekšējā gada bilancē norādītā summa",null,170]
[null,"R180",11,{"$f":"IF(AND(OR(K26=\"\",K26=0),OR(L26=\"\",L26=0),OR(T26=\"\",T26=0),OR(U26=\"\",U26=0)),\"G\",\"\")","v":"G"},null,null,null,"2. Iepriekšējā gada bilancē norādītās summas labojums",null,"180",null,null,null,null,null,null,"2. Iepriekšējā gada bilancē norādītās summas labojums",null,180]
[null,"R190",11,{"$f":"IF(AND(OR(K27=\"\",K27=0),OR(L27=\"\",L27=0),OR(T27=\"\",T27=0),OR(U27=\"\",U27=0)),\"G\",\"\")","v":"G"},null,null,null,"3. Finanšu instrumentu patiesās vērtības rezervju atlikuma palielinājums/samazinājums",null,"190",null,null,null,null,null,null,"3. Finanšu instrumentu patiesās vērtības rezervju atlikuma palielinājums/samazinājums",null,190]
[null,null,null,{"$f":"IF(AND(OR(K28=\"\",K28=0),OR(L28=\"\",L28=0),OR(T28=\"\",T28=0),OR(U28=\"\",U28=0)),\"G\",\"\")","v":"G"},null,null,null,"4. Pārskata gada bilancē norādītā summa perioda beigās",null,"200",{"$f":"SUM(K25:K27)","v":0},{"$f":"SUM(L25:L27)","v":0},null,null,null,null,"4. Pārskata gada bilancē norādītā summa perioda beigās",null,200,{"$f":"SUM(T25:T27)","v":0},{"$f":"SUM(U25:U27)","v":0}]
[null,null,null,{"$f":"D28","v":"G"}]
[null,null,null,{"$f":"D34","v":"G"},null,null,"V. Rezerves",null,null,"210",null,null,null,null,null,"V. Rezerves",null,null,210]
[null,"R220",{"$f":"COLUMN(K31)","v":11},{"$f":"IF(AND(OR(K31=\"\",K31=0),OR(L31=\"\",L31=0),OR(T31=\"\",T31=0),OR(U31=\"\",U31=0)),\"G\",\"\")","v":"G"},null,null,null,"1. Iepriekšējā gada bilancē norādītā summa",null,"220",null,null,null,null,null,null,"1. Iepriekšējā gada bilancē norādītā summa",null,220]
[null,"R230",11,{"$f":"IF(AND(OR(K32=\"\",K32=0),OR(L32=\"\",L32=0),OR(T32=\"\",T32=0),OR(U32=\"\",U32=0)),\"G\",\"\")","v":"G"},null,null,null,"2. Iepriekšējā gada bilancē norādītās summas labojums",null,"230",null,null,null,null,null,null,"2. Iepriekšējā gada bilancē norādītās summas labojums",null,230]
[null,"R240",11,{"$f":"IF(AND(OR(K33=\"\",K33=0),OR(L33=\"\",L33=0),OR(T33=\"\",T33=0),OR(U33=\"\",U33=0)),\"G\",\"\")","v":"G"},null,null,null,"3. Rezervju atlikuma palielinājums/samazinājums",null,"240",null,null,null,null,null,null,"3. Rezervju atlikuma palielinājums/samazinājums",null,240]
[null,null,null,{"$f":"IF(AND(OR(K34=\"\",K34=0),OR(L34=\"\",L34=0),OR(T34=\"\",T34=0),OR(U34=\"\",U34=0)),\"G\",\"\")","v":"G"},null,null,null,"4. Pārskata gada bilancē norādītā summa perioda beigās",null,"250",{"$f":"SUM(K31:K33)","v":0},{"$f":"SUM(L31:L33)","v":0},null,null,null,null,"4. Pārskata gada bilancē norādītā summa perioda beigās",null,250,{"$f":"SUM(T31:T33)","v":0},{"$f":"SUM(U31:U33)","v":0}]
[null,null,null,{"$f":"D34","v":"G"}]
[null,null,null,null,null,null,"VI. Nesadalītā peļņa",null,null,"260",null,null,null,null,null,"VI. Nesadalītā peļņa",null,null,260]
[null,"R270",{"$f":"COLUMN(K37)","v":11},{"$f":"IF(AND(OR(K37=\"\",K37=0),OR(L37=\"\",L37=0),OR(T37=\"\",T37=0),OR(U37=\"\",U37=0)),\"G\",\"\")","v":"G"},null,null,null,"1. Iepriekšējā gada bilancē norādītā summa",null,"270",null,null,null,null,null,null,"1. Iepriekšējā gada bilancē norādītā summa",null,270]
[null,"R280",11,"G",null,null,null,"2. Iepriekšējā gada bilancē norādītās summas labojums",null,"280",null,null,null,null,null,null,"2. Iepriekšējā gada bilancē norādītās summas labojums",null,280]
[null,"R290",{"$f":"COLUMN(K39)","v":11},{"$f":"IF(AND(OR(K39=\"\",K39=0),OR(L39=\"\",L39=0),OR(T39=\"\",T39=0),OR(U39=\"\",U39=0)),\"G\",\"\")","v":"G"},null,null,null,"3. Nesadalītās peļņas palielinājums/samazinājums",null,"290",null,null,null,null,null,null,"3. Nesadalītās peļņas palielinājums/samazinājums",null,290]
[null,null,{"$f":"COLUMN(K40)","v":11},{"$f":"IF(AND(OR(K40=\"\",K40=0),OR(L40=\"\",L40=0),OR(T40=\"\",T40=0),OR(U40=\"\",U40=0)),\"G\",\"\")","v":"G"},null,null,null,"4. Pārskata gada bilancē norādītā summa perioda beigās",null,"300",{"$f":"SUM(K37:K39)","v":0},{"$f":"SUM(L37:L39)","v":0},null,null,null,null,"4. Pārskata gada bilancē norādītā summa perioda beigās",null,300,{"$f":"SUM(T37:T39)","v":0},{"$f":"SUM(U37:U39)","v":0}]
[]
[null,null,null,null,null,null,"VI.1 Mazākumakcionāru līdzdalības daļa",null,null,{"$f":"IF(Pamatdati!$H$3=\"Konsolidētais uzņēmuma gada pārskats\",J40+1,\"---\")","v":"---"},null,null,null,null,null,"VI.1 Mazākumakcionāru līdzdalības daļa",null,null,301]
[null,"R302",{"$f":"COLUMN(K43)","v":11},{"$f":"IF(AND(OR(K43=\"\",K43=0),OR(L43=\"\",L43=0),OR(T43=\"\",T43=0),OR(U43=\"\",U43=0)),\"G\",\"\")","v":"G"},null,null,null,"1. Iepriekšējā gada bilancē norādītā summa",null,{"$f":"IF(Pamatdati!$H$3=\"Konsolidētais uzņēmuma gada pārskats\",J42+1,\"---\")","v":"---"},null,null,null,null,null,null,"1. Iepriekšējā gada bilancē norādītā summa",null,302]
[null,"R303",11,"G",null,null,null,"2. Iepriekšējā gada bilancē norādītās summas labojums",null,{"$f":"IF(Pamatdati!$H$3=\"Konsolidētais uzņēmuma gada pārskats\",J43+1,\"---\")","v":"---"},null,null,null,null,null,null,"2. Iepriekšējā gada bilancē norādītās summas labojums",null,303]
[null,"R304",11,"G",null,null,null,"3. Mazākumakcionāru līdzdalības daļas palielinājums/samazinājums",null,{"$f":"IF(Pamatdati!$H$3=\"Konsolidētais uzņēmuma gada pārskats\",J44+1,\"---\")","v":"---"},null,null,null,null,null,null,"3. Mazākumakcionāru līdzdalības daļas palielinājums/samazinājums",null,304]
[null,null,11,"G",null,null,null,"4. Pārskata gada bilancē norādītā summa perioda beigās",null,{"$f":"IF(Pamatdati!$H$3=\"Konsolidētais uzņēmuma gada pārskats\",J45+5,\"---\")","v":"---"},{"$f":"SUM(K43:K45)","v":0},{"$f":"SUM(L43:L45)","v":0},null,null,null,null,"4. Pārskata gada bilancē norādītā summa perioda beigās",null,309,{"$f":"SUM(T43:T45)","v":0},{"$f":"SUM(U43:U45)","v":0}]
[]
[null,null,null,null,null,null,"VII. Pašu kapitāls",null,null,"310",null,null,null,null,null,"VII. Pašu kapitāls",null,null,310]
[null,null,null,null,null,null,null,"1. Iepriekšējā gada bilancē norādītā summa",null,"320",{"$f":"SUM(K37,K31,K25,K19,K13,K7,K43)","v":0},{"$f":"SUM(L37,L31,L25,L19,L13,L7,L43)","v":0},null,null,null,null,"1. Iepriekšējā gada bilancē norādītā summa",null,320,{"$f":"SUM(T37,T31,T25,T19,T13,T7,T43)","v":0},{"$f":"SUM(U37,U31,U25,U19,U13,U7,U43)","v":0}]
[null,null,null,null,null,null,null,"2. Iepriekšējā gada bilancē norādītās summas labojums",null,"330",{"$f":"SUM(K38,K32,K26,K20,K14,K8,K44)","v":0},0,null,null,null,null,"2. Iepriekšējā gada bilancē norādītās summas labojums",null,330,{"$f":"SUM(T38,T32,T26,T20,T14,T8,T44)","v":0},0]
[null,null,null,null,null,null,null,"3. Pārskata gada bilancē norādītā summa perioda beigās",null,"340",0,0,null,null,null,null,"3. Pārskata gada bilancē norādītā summa perioda beigās",null,340,0,0]

{"sheet":"Ziedotāji un dāvinātāji","index":9,"n_rows":2,"n_cols":10,"rows_kept":2,"cut":false,"hidden":false,"merged":[[0,6,0,7]]}
[null,"4 \nsimboli","2 \nsimboli","ja LV tad 11 simboli\nja Arvalsts., tad līdz 20 simboliem","līdz 120 simboliem","līdz 120 simboliem","Skaits, max 2 cipari aiz komata",null,"2 \nsimboli","līdz 120 simboliem"]
[null,"Ziedotāja\n tips","Valsts","NMR kods / \npersonas kods","Nosaukums / \nvārds, uzvārds","Ārvalstu adrese","Nauda \n(euro)","Mantiskā \n(euro)","Mērķis","Komentārs"]

{"sheet":"Paraugs","index":10,"n_rows":11,"n_cols":10,"rows_kept":11,"cut":false,"hidden":false,"merged":[[0,6,0,7]]}
[null,"4 \nsimboli","2 \nsimboli","ja LV tad 11 simboli\nja Arvalsts., tad līdz 20 simboliem","līdz 120 simboliem","līdz 120 simboliem","Skaits, max 2 cipari aiz komata",null,"2 \nsimboli","līdz 120 simboliem"]
[null,"Ziedotāja\n tips","Valsts","NMR kods / \npersonas kods","Nosaukums / \nvārds, uzvārds","Ārvalstu adrese","Nauda \n(euro)","Mantiskā \n(euro)","Mērķis","Komentārs"]
[null,"LRJP","LV","???????????","????????????????????",null,10,null,"NL"]
[null,"LRJP","LV","???????????","????????????????????",null,null,10,"NM"]
[null,"LRFP","LV","???????????","????????????????????",null,10,null,"NL"]
[null,"LRFP","LV","??????????????","????????????????????",null,10,null,"NL"]
[null,"LRFP","LV","????????????","????????????????????",null,10,null,"NL"]
[null,"AVJP","DK","????????","????????????????????","????????????????????",10,null,"NL"]
[null,"AVJP","LT","?????????","????????????????????","????????????????????",10,null,"NL"]
[null,"AVJP","LT","????????????","????????????????????","????????????????????",10,null,"NL"]
[null,"ANON","LV",null,"????????????????????",null,10,null,"NL"]

{"sheet":"Pielikums vai piezīmes","index":11,"n_rows":1426,"n_cols":87,"rows_kept":1426,"cut":false,"hidden":true,"merged":[[1152,13,1153,46],[1152,48,1153,48],[1152,50,1153,83],[770,48,771,48],[817,48,818,48],[604,48,605,48],[627,48,628,48],[631,48,632,48],[635,48,636,48],[643,48,644,48],[666,48,667,48],[670,48,671,48],[674,48,675,48],[682,48,683,48],[705,48,706,48],[709,48,710,48],[713,48,714,48],[721,48,722,48],[744,48,745,48],[748,48,749,48],[752,48,753,48],[760,48,761,48],[614,48,615,48],[619,48,620,48],[653,48,654,48],[658,48,659,48],[692,48,693,48],[697,48,698,48],[731,48,732,48],[736,48,737,48],[983,13,985,13],[986,14,986,34],[478,48,479,48],[482,48,483,48],[490,48,491,48],[494,48,495,48],[509,48,510,48],[513,48,514,48],[517,48,518,48],[525,48,526,48],[529,48,530,48],[544,48,545,48],[548,48,549,48],[552,48,553,48],[560,48,561,48],[564,48,565,48],[588,48,589,48],[592,48,593,48],[596,48,597,48],[574,48,575,48],[580,48,581,48],[363,48,364,48],[367,48,368,48],[375,48,376,48],[379,48,380,48],[394,48,395,48],[398,48,399,48],[402,48,403,48],[410,48,411,48],[414,48,415,48],[439,48,440,48],[443,48,444,48],[447,48,448,48],[455,48,456,48],[459,48,460,48],[474,48,475,48],[424,48,425,48],[429,48,430,48],[1418,66,1418,79],[1418,80,1418,83],[1419,66,1419,79],[1419,80,1419,83],[1420,66,1420,79],[1420,80,1420,83],[1400,51,1400,71],[1401,51,1401,71],[1409,66,1410,79],[1409,80,1410,83],[1411,66,1411,79],[1411,80,1411,83],[1412,66,1412,79],[1412,80,1412,83],[1413,66,1413,79],[1413,80,1413,83],[1414,66,1414,79],[1414,80,1414,83],[1415,66,1415,79],[1415,80,1415,83],[1416,66,1416,79],[1416,80,1416,83],[1417,66,1417,79],[1417,80,1417,83],[1412,51,1412,65],[1413,51,1413,65],[1414,51,1414,65],[1401,72,1401,75],[1401,76,1401,79],[1401,80,1401,83],[1413,43,1413,46],[1414,43,1414,46],[1415,43,1415,46],[1416,43,1416,46],[1417,43,1417,46],[1418,43,1418,46],[1419,43,1419,46],[1420,43,1420,46],[1411,29,1411,42],[1409,29,1410,42],[1412,29,1412,42],[1413,29,1413,42],[1414,29,1414,42],[1415,29,1415,42],[1416,29,1416,42],[1417,29,1417,42],[1418,29,1418,42],[1419,29,1419,42],[1420,29,1420,42],[1389,13,1391,13],[1392,14,1392,34],[1389,14,1391,34],[1393,14,1393,34],[1394,14,1394,34],[1395,14,1395,34],[1396,14,1396,34],[1397,14,1397,34],[1398,14,1398,34],[1399,14,1399,34],[1400,14,1400,34],[1401,14,1401,34],[1401,35,1401,38],[1401,39,1401,42],[1409,43,1410,46],[1411,43,1411,46],[1412,43,1412,46],[1401,43,1401,46],[1409,14,1410,28],[1395,35,1395,38],[1395,39,1395,42],[1395,43,1395,46],[1396,35,1396,38],[1396,39,1396,42],[1396,43,1396,46],[1397,35,1397,38],[1397,39,1397,42],[1397,43,1397,46],[1399,35,1399,38],[1399,39,1399,42],[1399,43,1399,46],[1409,13,1410,13],[1367,14,1367,26],[1368,14,1368,26],[1369,14,1369,26],[1370,14,1370,26],[1380,14,1380,42],[1376,14,1376,42],[1375,14,1375,42],[1377,14,1377,42],[1378,14,1378,42],[1379,14,1379,42],[1355,27,1360,30],[1355,31,1360,34],[1355,35,1360,38],[1355,39,1360,42],[1381,14,1381,42],[1382,14,1382,42],[1383,14,1383,42],[1366,27,1366,30],[1366,31,1366,34],[1366,35,1366,38],[1366,39,1366,42],[1367,27,1367,30],[1367,31,1367,34],[1367,35,1367,38],[1367,39,1367,42],[1370,27,1370,30],[1370,31,1370,34],[1370,35,1370,38],[1370,39,1370,42],[1371,35,1371,38],[1371,39,1371,42],[1361,31,1361,34],[1299,23,1299,25],[1299,26,1299,29],[1303,23,1303,25],[1303,26,1303,29],[1341,27,1341,30],[1347,14,1347,26],[1355,13,1360,13],[1361,14,1361,26],[1355,14,1360,26],[1362,14,1362,26],[1363,14,1363,26],[1299,30,1299,35],[1303,30,1303,35],[1341,35,1341,38],[1345,14,1345,26],[1346,14,1346,26],[1340,27,1340,30],[1340,31,1340,34],[1340,35,1340,38],[1338,31,1338,34],[1338,35,1338,38],[1304,23,1304,25],[1304,26,1304,29],[1304,30,1304,35],[1304,36,1304,41],[1341,39,1341,42],[1305,14,1305,22],[1335,13,1337,13],[1303,14,1303,22],[1304,14,1304,22],[1344,27,1344,30],[1344,31,1344,34],[1284,19,1284,42],[1297,23,1297,25],[1297,26,1297,29],[1297,30,1297,35],[1301,23,1301,25],[1301,26,1301,29],[1301,30,1301,35],[1301,36,1301,41],[1301,42,1301,46],[1302,23,1302,25],[1302,26,1302,29],[1302,30,1302,35],[1302,36,1302,41],[1302,42,1302,46],[1303,36,1303,41],[1303,42,1303,46],[1335,27,1337,30],[1335,31,1337,34],[1297,36,1297,41],[1297,42,1297,46],[1298,23,1298,25],[1298,26,1298,29],[1298,30,1298,35],[1298,36,1298,41],[1298,42,1298,46],[1292,42,1295,46],[1296,42,1296,46],[1296,36,1296,41],[1296,30,1296,35],[1296,26,1296,29],[1301,14,1301,22],[1302,14,1302,22],[1251,13,1252,46],[1255,13,1256,46],[1237,35,1238,38],[1237,39,1238,46],[1239,35,1239,38],[1239,39,1239,46],[1274,19,1274,42],[1274,43,1274,46],[1275,19,1275,42],[1275,43,1275,46],[1267,14,1267,18],[1268,14,1268,18],[1269,14,1269,18],[1270,14,1270,18],[1271,14,1271,18],[1246,35,1246,38],[1246,39,1246,46],[1247,35,1247,38],[1247,39,1247,46],[1248,35,1248,38],[1248,39,1248,46],[1246,14,1246,34],[1247,14,1247,34],[1248,14,1248,34],[1263,19,1263,42],[1263,43,1263,46],[1264,19,1264,42],[1264,43,1264,46],[1265,19,1265,42],[1265,43,1265,46],[1266,19,1266,42],[1266,43,1266,46],[1216,14,1216,34],[1217,14,1217,34],[1218,14,1218,34],[1219,14,1219,34],[1220,14,1220,34],[1221,14,1221,34],[1210,13,1211,13],[1224,14,1224,18],[1237,14,1238,34],[1239,14,1239,34],[1240,14,1240,34],[1241,14,1241,34],[1225,19,1225,46],[1216,35,1216,38],[1216,39,1216,46],[1217,35,1217,38],[1217,39,1217,46],[1218,35,1218,38],[1218,39,1218,46],[1219,35,1219,38],[1219,39,1219,46],[1220,35,1220,38],[1220,39,1220,46],[1221,35,1221,38],[1221,39,1221,46],[1226,19,1226,46],[1227,19,1227,46],[1228,19,1228,46],[1229,19,1229,46],[1230,19,1230,46],[1231,19,1231,46],[1232,19,1232,46],[1166,43,1166,46],[1167,35,1167,38],[1147,19,1147,46],[1159,43,1159,46],[1180,19,1180,22],[1180,23,1180,26],[1162,35,1162,38],[1162,39,1162,42],[1162,43,1162,46],[1163,35,1163,38],[1163,39,1163,42],[1162,14,1162,34],[1163,14,1163,34],[1166,35,1166,38],[1166,39,1166,42],[1166,14,1166,34],[1167,14,1167,34],[1172,14,1175,18],[1167,39,1167,42],[1167,43,1167,46],[1148,19,1148,46],[1149,19,1149,46],[1150,19,1150,46],[1159,35,1159,38],[1159,39,1159,42],[1163,43,1163,46],[1164,35,1164,38],[1164,39,1164,42],[1164,43,1164,46],[1165,35,1165,38],[1165,39,1165,42],[1165,43,1165,46],[983,14,985,34],[987,14,987,34],[988,14,988,34],[1000,13,1002,13],[1003,14,1003,34],[1000,14,1002,34],[1004,14,1004,34],[1005,14,1005,34],[1006,14,1006,34],[1007,14,1007,34],[1008,14,1008,34],[1009,14,1009,34],[1010,14,1010,34],[1011,14,1011,34],[1012,14,1012,34],[991,14,991,34],[989,14,989,34],[990,14,990,34],[992,14,992,34],[993,14,993,34],[994,14,994,34],[995,14,995,34],[916,14,916,22],[917,14,917,22],[918,14,918,22],[926,14,926,22],[922,14,925,22],[927,14,927,22],[928,14,928,22],[929,14,929,22],[965,13,967,13],[965,14,967,34],[968,14,968,34],[969,14,969,34],[970,14,970,34],[971,14,971,34],[972,14,972,34],[973,14,973,34],[974,14,974,34],[926,27,926,30],[926,31,926,34],[961,27,961,30],[934,27,934,30],[934,31,934,34],[932,14,932,22],[933,14,933,22],[934,14,934,22],[935,23,935,26],[935,27,935,30],[935,31,935,34],[933,27,933,30],[954,27,954,30],[954,31,954,34],[958,27,958,30],[914,14,914,22],[915,14,915,22],[873,13,873,46],[874,13,875,46],[881,23,881,26],[881,27,881,34],[879,27,880,34],[879,23,880,26],[905,23,908,26],[905,27,908,30],[905,31,908,34],[905,35,908,38],[905,39,908,42],[905,43,908,46],[888,23,888,26],[888,27,888,34],[889,23,889,26],[889,27,889,34],[890,23,890,26],[890,27,890,34],[910,23,910,26],[910,27,910,30],[910,31,910,34],[888,14,888,22],[889,14,889,22],[890,14,890,22],[910,35,910,38],[910,39,910,42],[910,43,910,46],[911,23,911,26],[911,27,911,30],[911,39,911,42],[842,14,842,22],[841,14,841,22],[843,14,843,22],[844,14,844,22],[841,23,841,26],[827,19,827,22],[828,19,828,22],[829,19,829,22],[830,19,830,22],[831,19,831,22],[832,19,832,22],[833,19,833,22],[835,13,835,46],[836,13,837,46],[843,23,843,26],[843,27,843,34],[844,23,844,26],[844,27,844,34],[842,23,842,26],[827,23,827,36],[828,23,828,36],[829,23,829,36],[830,23,830,36],[831,23,831,36],[832,23,832,36],[833,23,833,36],[760,14,761,43],[770,14,771,46],[774,14,775,46],[783,14,783,22],[777,14,782,22],[784,14,784,22],[785,14,785,22],[786,14,786,22],[787,14,787,22],[788,14,788,22],[789,14,789,22],[790,14,790,22],[791,14,791,22],[792,14,792,22],[805,14,805,22],[800,14,804,22],[806,14,806,22],[791,31,791,34],[792,23,792,26],[792,27,792,30],[792,31,792,34],[806,23,806,26],[806,27,806,30],[806,31,806,34],[791,23,791,26],[791,27,791,30],[777,31,782,34],[783,23,783,26],[783,27,783,30],[783,31,783,34],[763,44,763,46],[766,44,766,46],[543,44,543,46],[544,44,545,46],[547,44,547,46],[548,44,549,46],[603,44,603,46],[604,44,605,46],[705,14,706,43],[709,14,710,43],[713,14,714,43],[721,14,722,43],[731,14,732,46],[736,14,737,46],[744,14,745,43],[748,14,749,43],[752,14,753,43],[701,44,701,46],[702,44,702,46],[717,44,717,46],[718,44,718,46],[716,44,716,46],[720,44,720,46],[721,44,722,46],[724,44,724,46],[727,44,727,46],[728,44,728,46],[740,44,740,46],[741,44,741,46],[713,44,714,46],[614,14,615,46],[648,44,648,46],[661,44,661,46],[665,44,665,46],[402,14,403,43],[410,14,411,43],[414,14,415,43],[379,14,380,43],[344,14,345,43],[332,14,333,43],[340,14,341,43],[359,14,360,43],[363,14,364,43],[367,14,368,43],[375,14,376,43],[394,14,395,43],[398,14,399,43],[384,44,384,46],[389,44,389,46],[393,44,393,46],[397,44,397,46],[367,44,368,46],[370,44,370,46],[374,44,374,46],[394,44,395,46],[349,44,349,46],[359,44,360,46],[220,14,220,18],[289,25,289,36],[289,37,289,46],[290,20,290,24],[290,37,290,46],[274,13,275,46],[283,20,286,24],[293,20,293,24],[293,25,293,36],[299,13,302,13],[299,14,302,19],[293,37,293,46],[294,20,294,24],[294,25,294,36],[294,37,294,46],[295,20,295,24],[295,25,295,36],[295,37,295,46],[296,20,296,24],[296,25,296,36],[296,37,296,46],[283,13,286,13],[256,14,257,46],[256,13,257,13],[261,14,262,46],[261,13,262,13],[228,43,228,46],[229,43,229,46],[230,43,230,46],[226,43,226,46],[246,42,246,45],[244,13,245,46],[208,13,211,13],[224,14,224,42],[225,14,225,42],[226,14,226,42],[227,14,227,42],[228,14,228,42],[229,14,229,42],[230,14,230,42],[231,14,231,42],[232,14,232,42],[198,14,198,22],[199,14,199,22],[200,14,200,22],[201,14,201,22],[1224,19,1224,46],[1210,35,1211,38],[347,44,347,46],[350,44,350,46],[351,44,351,46],[355,44,355,46],[356,44,356,46],[371,44,371,46],[372,44,372,46],[382,44,382,46],[385,44,385,46],[386,44,386,46],[390,44,390,46],[391,44,391,46],[406,44,406,46],[407,44,407,46],[283,25,286,36],[287,37,287,46],[482,14,483,43],[490,14,491,43],[494,14,495,43],[509,14,510,43],[513,14,514,43],[517,14,518,43],[525,14,526,43],[529,14,530,43],[544,14,545,43],[548,14,549,43],[552,14,553,43],[560,14,561,43],[564,14,565,43],[358,44,358,46],[419,44,419,46],[757,44,757,46],[755,44,755,46],[666,44,667,46],[669,44,669,46],[670,44,671,46],[646,44,646,46],[649,44,649,46],[650,44,650,46],[662,44,662,46],[663,44,663,46],[673,44,673,46],[674,44,675,46],[677,44,677,46],[681,44,681,46],[682,44,683,46],[678,44,678,46],[362,44,362,46],[319,44,319,46],[323,44,323,46],[767,44,767,46],[898,44,898,46],[899,44,899,46],[532,44,532,46],[535,44,535,46],[536,44,536,46],[540,44,540,46],[541,44,541,46],[556,44,556,46],[557,44,557,46],[567,44,567,46],[570,44,570,46],[653,14,654,46],[658,14,659,46],[666,14,667,43],[670,14,671,43],[674,14,675,43],[682,14,683,43],[692,14,693,46],[697,14,698,46],[354,44,354,46],[331,44,331,46],[332,44,333,46],[335,44,335,46],[339,44,339,46],[340,44,341,46],[343,44,343,46],[863,35,863,38],[863,39,863,46],[864,19,864,22],[1101,43,1101,46],[1102,23,1102,26],[1102,27,1102,30],[1102,31,1102,34],[1102,35,1102,38],[1102,39,1102,42],[1102,43,1102,46],[1103,23,1103,26],[1129,43,1129,46],[1158,14,1158,34],[1156,14,1157,34],[1116,23,1116,26],[1116,27,1116,30],[1116,31,1116,34],[1116,35,1116,38],[1116,39,1116,42],[1116,43,1116,46],[1119,23,1119,26],[1119,27,1119,30],[1119,31,1119,34],[1119,35,1119,38],[1119,39,1119,42],[1119,43,1119,46],[1147,14,1147,18],[1148,14,1148,18],[1149,14,1149,18],[1150,14,1150,18],[1110,14,1115,22],[1116,14,1116,22],[1117,14,1117,22],[1145,14,1145,18],[1146,14,1146,18],[1118,14,1118,22],[1119,14,1119,22],[1120,14,1120,22],[1121,14,1121,22],[1122,14,1122,22],[1123,14,1123,22],[1124,14,1124,22],[1125,14,1125,22],[1141,14,1141,18],[1137,14,1140,18],[1142,14,1142,18],[1143,14,1143,18],[1132,13,1132,46],[1133,13,1134,46],[1123,23,1123,26],[1123,27,1123,30],[1123,31,1123,34],[1123,35,1123,38],[1123,39,1123,42],[1123,43,1123,46],[1124,23,1124,26],[1124,27,1124,30],[1124,31,1124,34],[1124,35,1124,38],[1124,39,1124,42],[1124,43,1124,46],[1125,23,1125,26],[1125,27,1125,30],[1125,31,1125,34],[1125,35,1125,38],[1125,39,1125,42],[1125,43,1125,46],[1105,14,1105,22],[1144,14,1144,18],[1118,23,1118,26],[1118,27,1118,30],[1118,31,1118,34],[1118,35,1118,38],[1118,39,1118,42],[1121,23,1121,26],[1121,27,1121,30],[1121,31,1121,34],[1121,35,1121,38],[1121,39,1121,42],[1121,43,1121,46],[1106,14,1106,22],[1136,13,1136,46],[1117,23,1117,26],[1117,27,1117,30],[1117,31,1117,34],[1117,35,1117,38],[1117,39,1117,42],[1117,43,1117,46],[1120,23,1120,26],[1120,27,1120,30],[1120,31,1120,34],[1120,35,1120,38],[1137,13,1140,13],[1106,23,1106,26],[1106,27,1106,30],[1106,31,1106,34],[1107,43,1107,46],[1110,23,1115,26],[1110,13,1115,13],[1091,13,1096,13],[1072,13,1077,13],[1091,14,1096,22],[1097,14,1097,22],[1098,14,1098,22],[1099,14,1099,22],[1100,14,1100,22],[1101,14,1101,22],[1102,14,1102,22],[1103,14,1103,22],[1104,14,1104,22],[1100,23,1100,26],[1100,27,1100,30],[1100,31,1100,34],[1100,35,1100,38],[1081,27,1081,30],[1081,31,1081,34],[1081,35,1081,38],[1085,23,1085,26],[1085,27,1085,30],[1085,31,1085,34],[1085,35,1085,38],[1080,35,1080,38],[1078,14,1078,22],[1072,14,1077,22],[1079,14,1079,22],[1080,14,1080,22],[1080,23,1080,26],[1083,14,1083,22],[1081,14,1081,22],[1082,14,1082,22],[1079,23,1079,26],[922,23,925,26],[922,27,925,30],[922,31,925,34],[922,35,925,38],[922,39,925,42],[922,43,925,46],[919,27,919,30],[919,35,919,38],[909,23,909,26],[909,27,909,30],[1061,35,1061,38],[1061,39,1061,42],[1061,43,1061,46],[975,14,975,34],[976,14,976,34],[977,14,977,34],[1032,14,1034,34],[1035,14,1035,34],[1036,14,1036,34],[1037,14,1037,34],[1038,14,1038,34],[1044,14,1044,34],[1061,27,1061,30],[1061,31,1061,34],[993,43,993,46],[994,35,994,38],[994,39,994,42],[951,27,951,30],[951,31,951,34],[909,14,909,22],[910,14,910,22],[911,14,911,22],[864,23,864,26],[864,27,864,30],[864,31,864,34],[864,35,864,38],[864,39,864,46],[865,19,865,22],[865,23,865,26],[865,27,865,30],[862,39,862,46],[867,35,867,38],[867,39,867,46],[868,19,868,22],[871,19,871,22],[871,23,871,26],[871,27,871,30],[871,31,871,34],[871,35,871,38],[871,39,871,46],[870,35,870,38],[870,39,870,46],[870,31,870,34],[868,23,868,26],[868,27,868,30],[868,31,868,34],[862,19,862,22],[862,23,862,26],[862,27,862,30],[862,31,862,34],[862,35,862,38],[869,39,869,46],[870,19,870,22],[870,23,870,26],[854,13,855,46],[841,27,841,34],[842,27,842,34],[823,19,823,22],[824,19,824,22],[800,31,804,34],[805,27,805,30],[805,23,805,26],[800,27,804,30],[800,23,804,26],[805,31,805,34],[788,23,788,26],[788,27,788,30],[788,31,788,34],[789,23,789,26],[789,27,789,30],[789,31,789,34],[790,23,790,26],[790,27,790,30],[790,31,790,34],[827,14,827,18],[828,14,828,18],[829,14,829,18],[830,14,830,18],[831,14,831,18],[807,23,807,26],[807,27,807,30],[807,31,807,34],[808,23,808,26],[808,27,808,30],[832,14,832,18],[833,14,833,18],[759,44,759,46],[760,44,761,46],[794,13,794,46],[795,13,796,46],[765,44,765,46],[777,23,782,26],[777,27,782,30],[786,23,786,26],[786,27,786,30],[786,31,786,34],[787,23,787,26],[787,27,787,30],[787,31,787,34],[685,44,685,46],[688,44,688,46],[689,44,689,46],[726,44,726,46],[739,44,739,46],[743,44,743,46],[744,44,745,46],[747,44,747,46],[748,44,749,46],[751,44,751,46],[752,44,753,46],[700,44,700,46],[704,44,704,46],[705,44,706,46],[708,44,708,46],[709,44,710,46],[712,44,712,46],[756,44,756,46],[687,44,687,46],[679,44,679,46],[622,44,622,46],[626,44,626,46],[627,44,628,46],[630,44,630,46],[631,44,632,46],[634,44,634,46],[635,44,636,46],[638,44,638,46],[642,44,642,46],[643,44,644,46],[623,44,623,46],[624,44,624,46],[639,44,639,46],[640,44,640,46],[619,14,620,46],[627,14,628,43],[631,14,632,43],[635,14,636,43],[643,14,644,43],[607,44,607,46],[609,44,609,46],[583,44,583,46],[587,44,587,46],[588,44,589,46],[591,44,591,46],[592,44,593,46],[595,44,595,46],[596,44,597,46],[610,44,610,46],[611,44,611,46],[569,44,569,46],[551,44,551,46],[552,44,553,46],[555,44,555,46],[559,44,559,46],[560,44,561,46],[563,44,563,46],[564,44,565,46],[574,14,575,46],[604,14,605,43],[596,14,597,43],[592,14,593,43],[588,14,589,43],[580,14,581,46],[571,44,571,46],[584,44,584,46],[585,44,585,46],[600,44,600,46],[601,44,601,46],[599,44,599,46],[493,44,493,46],[520,44,520,46],[524,44,524,46],[525,44,526,46],[528,44,528,46],[529,44,530,46],[486,44,486,46],[487,44,487,46],[497,44,497,46],[500,44,500,46],[501,44,501,46],[505,44,505,46],[506,44,506,46],[521,44,521,46],[522,44,522,46],[512,44,512,46],[513,44,514,46],[516,44,516,46],[517,44,518,46],[417,44,417,46],[474,44,475,46],[477,44,477,46],[478,44,479,46],[481,44,481,46],[465,44,465,46]],"merged_total":5095,"flags":["merged_cut"]}
[{"$f":"COLUMN(AY1)-COLUMN(N1)","v":37},"xlIzm","xlGr","MI","MA","V","L","RowOffset","xmlIdent","xmlClmn","width 875; 1040; 1410"]
[]
[null,"IZM","GR","MI","MA","VI","LI",null,null,null,null,null,null,"Finanšu pārskata pielikums vai piezīmes",null,null,null,null,null,null,null,null,null,null,null,null,null,null,null,null,null,null,null,null,null,null,null,null,null,null,null,null,null,null,null,null,null,null,{"$f":"IF(Pamatdati!$H$5=Pamatdati!$Q$5,IF(Pamatdati!$H$8-1=Pamatdati!$Q$9,\"IPG\",\"PG\"),\"N\")","v":"PG"},null,"Tikai salīdzināšanai"]
[]
[null,1,null,"x","x","x","x",null,null,null,null,null,null,"1.","Sabiedrības sniegtā informācija",null,null,null,null,null,null,null,null,null,null,null,null,null,null,null,null,null,null,null,null,null,null,null,null,null,null,null,null,null,null,null,null,null,null,null,"1.","Sabiedrības sniegtā informācija"]
[null,1]
[null,1,null,"x","x","x","x",null,"R101",{"$f":"\"L:\"&COLUMN(AS7)","v":"L:45"},null,null,null,"1.1.","Vidējais darbinieku skaits",null,null,null,null,null,null,null,null,null,null,null,null,null,null,null,null,null,null,null,null,null,null,null,null,null,null,null,null,null,null,null,null,null,null,null,"1.1.","Vidējais darbinieku skaits"]
[null,3,{"$f":"C9","v":""}]
[null,3,{"$f":"IF(C12=\"GS\",\"S\",\"\")","v":""},null,null,"x","x",null,null,null,null,null,null,"1.2.","Vidējais darbinieku skaits sadalījumā pa kategorijām:",null,null,null,null,null,null,null,null,null,null,null,null,null,null,null,null,null,null,null,null,null,null,null,null,null,null,null,null,null,null,null,null,null,null,null,"1.2.","Vidējais darbinieku skaits sadalījumā pa kategorijām:"]
[null,3,{"$f":"IFERROR(IF(OR(AS10<>\"\",CD10<>\"\"),\"GS\",\"G\"),\"GS\")","v":"G"},null,null,"x","x",null,"R10201",{"$f":"\"L:\"&COLUMN(AS10)","v":"L:45"},null,null,null,"1.2.1.","valdes locekļi",null,null,null,null,null,null,null,null,null,null,null,null,null,null,null,null,null,null,null,null,null,null,null,null,null,null,null,null,null,null,null,null,null,null,null,"1.2.1.","valdes locekļi"]
[null,3,{"$f":"IFERROR(IF(OR(AS11<>\"\",CD11<>\"\"),\"GS\",\"G\"),\"GS\")","v":"G"},null,null,"x","x",null,"R10202",{"$f":"\"L:\"&COLUMN(AS11)","v":"L:45"},null,null,null,"1.2.2.","padomes locekļi",null,null,null,null,null,null,null,null,null,null,null,null,null,null,null,null,null,null,null,null,null,null,null,null,null,null,null,null,null,null,null,null,null,null,null,"1.2.2.","padomes locekļi"]
[null,3,{"$f":"IFERROR(IF(OR(AS12<>\"\",CD12<>\"\"),\"GS\",\"G\"),\"GS\")","v":"G"},null,null,"x","x",null,"R10203",{"$f":"\"L:\"&COLUMN(AS12)","v":"L:45"},null,null,null,"1.2.3.","pārējie darbinieki",null,null,null,null,null,null,null,null,null,null,null,null,null,null,null,null,null,null,null,null,null,null,null,null,null,null,null,null,null,null,null,null,null,null,null,"1.2.3.","pārējie darbinieki"]
[null,3,{"$f":"C14","v":""}]
[null,3,{"$f":"IF(C15=\"GS\",\"S\",\"\")","v":""},null,null,"x","x",null,null,null,null,null,null,"1.3.","Detalizēta informācija par naudas un tās ekvivalentu atlikumiem (naudas plūsmas pārskatā) pārskata gada sākumā un beigās",null,null,null,null,null,null,null,null,null,null,null,null,null,null,null,null,null,null,null,null,null,null,null,null,null,null,null,null,null,null,null,null,null,null,null,"1.3.","Detalizēta informācija par naudas un tās ekvivalentu atlikumiem (naudas plūsmas pārskatā) pārskata gada sākumā un beigās"]
[null,3,{"$f":"IFERROR(IF(OR(N15<>\"\",AY15<>\"\"),\"GS\",\"G\"),\"GS\")","v":"G"},null,null,null,null,null,"R103",{"$f":"COLUMN(N15)","v":14},{"$f":"LEFT(IF(LEN(N15)<LEN(AY15),AY15,N15),LEN(IF(LEN(N15)<LEN(AY15),AY15,N15))/2)","v":""},null,null,null,null,null,null,null,null,null,null,null,null,null,null,null,null,null,null,null,null,null,null,null,null,null,null,null,null,null,null,null,null,null,null,null,null,null,null,null,null,null,null,null,null,null,null,null,null,null,null,null,null,null,null,null,null,null,null,null,null,null,null,null,null,null,null,null,null,null,null,null,null,null,null,null,{"$f":"N14","v":"1.3."}]
[null,3,{"$f":"C15","v":"G"},null,null,null,null,null,null,{"$f":"COLUMN(N16)","v":14},{"$f":"RIGHT(IF(LEN(N15)<LEN(AY15),AY15,N15),LEN(IF(LEN(N15)<LEN(AY15),AY15,N15))/2)","v":""}]
[null,2,{"$f":"C18","v":""}]
[null,2,{"$f":"IF(C19=\"GS\",\"S\",\"\")","v":""},null,"x","x","x",null,null,null,null,null,null,"1.4.","Informācija par pieņemto grāmatvedības politiku, tās izmaiņām un atbilstību pieņēmumam, ka sabiedrība darbosies arī turpmāk:",null,null,null,null,null,null,null,null,null,null,null,null,null,null,null,null,null,null,null,null,null,null,null,null,null,null,null,null,null,null,null,null,null,null,null,"1.4.","Informācija par pieņemto grāmatvedības politiku, tās izmaiņām un atbilstību pieņēmumam, ka sabiedrība darbosies arī turpmāk:"]
[null,2,{"$f":"IFERROR(IF(OR(N19<>\"\",AY19<>\"\"),\"GS\",\"G\"),\"GS\")","v":"G"},null,null,null,null,null,"R104",{"$f":"COLUMN(N19)","v":14},{"$f":"LEFT(IF(LEN(N19)<LEN(AY19),AY19,N19),LEN(IF(LEN(N19)<LEN(AY19),AY19,N19))/2)","v":""},null,null,null,null,null,null,null,null,null,null,null,null,null,null,null,null,null,null,null,null,null,null,null,null,null,null,null,null,null,null,null,null,null,null,null,null,null,null,null,null,null,null,null,null,null,null,null,null,null,null,null,null,null,null,null,null,null,null,null,null,null,null,null,null,null,null,null,null,null,null,null,null,null,null,null,{"$f":"N18","v":"1.4."}]
[null,2,{"$f":"C19","v":"G"},null,null,null,null,null,null,{"$f":"COLUMN(N20)","v":14},{"$f":"RIGHT(IF(LEN(N19)<LEN(AY19),AY19,N19),LEN(IF(LEN(N19)<LEN(AY19),AY19,N19))/2)","v":""}]
[null,2]
[null,2,null,null,"x","x","x",null,null,null,null,null,null,"1.4.1.","ilgtermiņa ieguldījumu uzskaite:",null,null,null,null,null,null,null,null,null,null,null,null,null,null,null,null,null,null,null,null,null,null,null,null,null,null,null,null,null,null,null,null,null,null,null,"1.4.1.","ilgtermiņa ieguldījumu uzskaite:"]
[null,2,{"$f":"IF(C24=\"GS\",\"S\",\"\")","v":""},null,"x","x","x",null,null,null,null,null,null,"1.4.1.1.","nemateriālo ieguldījumu uzskaite",null,null,null,null,null,null,null,null,null,null,null,null,null,null,null,null,null,null,null,null,null,null,null,null,null,null,null,null,null,null,null,null,null,null,null,"1.4.1.1.","nemateriālo ieguldījumu uzskaite"]
[null,2,{"$f":"IFERROR(IF(OR(N24<>\"\",AY24<>\"\"),\"GS\",\"G\"),\"GS\")","v":"G"},null,null,null,null,null,"R1040101",{"$f":"COLUMN(N24)","v":14},{"$f":"LEFT(IF(LEN(N24)<LEN(AY24),AY24,N24),LEN(IF(LEN(N24)<LEN(AY24),AY24,N24))/2)","v":""},null,null,null,null,null,null,null,null,null,null,null,null,null,null,null,null,null,null,null,null,null,null,null,null,null,null,null,null,null,null,null,null,null,null,null,null,null,null,null,null,null,null,null,null,null,null,null,null,null,null,null,null,null,null,null,null,null,null,null,null,null,null,null,null,null,null,null,null,null,null,null,null,null,null,null,{"$f":"N23","v":"1.4.1.1."}]
[null,2,{"$f":"C24","v":"G"},null,null,null,null,null,null,{"$f":"COLUMN(N25)","v":14},{"$f":"RIGHT(IF(LEN(N24)<LEN(AY24),AY24,N24),LEN(IF(LEN(N24)<LEN(AY24),AY24,N24))/2)","v":""}]
[null,2,{"$f":"IF(C27=\"GS\",\"S\",\"\")","v":""},null,"x","x","x",null,null,null,null,null,null,"1.4.1.2.","pamatlīdzekļu uzskaite (novērtēšana, nolietojuma metode, dzīvnieku un augu uzskaite)",null,null,null,null,null,null,null,null,null,null,null,null,null,null,null,null,null,null,null,null,null,null,null,null,null,null,null,null,null,null,null,null,null,null,null,"1.4.1.2.","pamatlīdzekļu uzskaite (novērtēšana, nolietojuma metode, dzīvnieku un augu uzskaite)"]
[null,2,{"$f":"IFERROR(IF(OR(N27<>\"\",AY27<>\"\"),\"GS\",\"G\"),\"GS\")","v":"G"},null,null,null,null,null,"R1040102",{"$f":"COLUMN(N27)","v":14},{"$f":"LEFT(IF(LEN(N27)<LEN(AY27),AY27,N27),LEN(IF(LEN(N27)<LEN(AY27),AY27,N27))/2)","v":""},null,null,null,null,null,null,null,null,null,null,null,null,null,null,null,null,null,null,null,null,null,null,null,null,null,null,null,null,null,null,null,null,null,null,null,null,null,null,null,null,null,null,null,null,null,null,null,null,null,null,null,null,null,null,null,null,null,null,null,null,null,null,null,null,null,null,null,null,null,null,null,null,null,null,null,{"$f":"N26","v":"1.4.1.2."}]
[null,2,{"$f":"C27","v":"G"},null,null,null,null,null,null,{"$f":"COLUMN(N28)","v":14},{"$f":"RIGHT(IF(LEN(N27)<LEN(AY27),AY27,N27),LEN(IF(LEN(N27)<LEN(AY27),AY27,N27))/2)","v":""}]
[null,2,{"$f":"IF(C30=\"GS\",\"S\",\"\")","v":""},null,"x","x","x",null,null,null,null,null,null,"1.4.1.3.","ilgtermiņa finanšu ieguldījumu uzskaite",null,null,null,null,null,null,null,null,null,null,null,null,null,null,null,null,null,null,null,null,null,null,null,null,null,null,null,null,null,null,null,null,null,null,null,"1.4.1.3.","ilgtermiņa finanšu ieguldījumu uzskaite"]
[null,2,{"$f":"IFERROR(IF(OR(N30<>\"\",AY30<>\"\"),\"GS\",\"G\"),\"GS\")","v":"G"},null,null,null,null,null,"R1040103",{"$f":"COLUMN(N30)","v":14},{"$f":"LEFT(IF(LEN(N30)<LEN(AY30),AY30,N30),LEN(IF(LEN(N30)<LEN(AY30),AY30,N30))/2)","v":""},null,null,null,null,null,null,null,null,null,null,null,null,null,null,null,null,null,null,null,null,null,null,null,null,null,null,null,null,null,null,null,null,null,null,null,null,null,null,null,null,null,null,null,null,null,null,null,null,null,null,null,null,null,null,null,null,null,null,null,null,null,null,null,null,null,null,null,null,null,null,null,null,null,null,null,{"$f":"N29","v":"1.4.1.3."}]
[null,2,{"$f":"C30","v":"G"},null,null,null,null,null,null,{"$f":"COLUMN(N31)","v":14},{"$f":"RIGHT(IF(LEN(N30)<LEN(AY30),AY30,N30),LEN(IF(LEN(N30)<LEN(AY30),AY30,N30))/2)","v":""}]
[null,2,{"$f":"IF(C33=\"GS\",\"S\",\"\")","v":""},null,"x","x","x",null,null,null,null,null,null,"1.4.1.4.","papildus sniegtā informācija, ja tāda ir",null,null,null,null,null,null,null,null,null,null,null,null,null,null,null,null,null,null,null,null,null,null,null,null,null,null,null,null,null,null,null,null,null,null,null,"1.4.1.4.","papildus sniegtā informācija, ja tāda ir"]
[null,2,{"$f":"IFERROR(IF(OR(N33<>\"\",AY33<>\"\"),\"GS\",\"G\"),\"GS\")","v":"G"},null,null,null,null,null,"R1040104",{"$f":"COLUMN(N33)","v":14},{"$f":"LEFT(IF(LEN(N33)<LEN(AY33),AY33,N33),LEN(IF(LEN(N33)<LEN(AY33),AY33,N33))/2)","v":""},null,null,null,null,null,null,null,null,null,null,null,null,null,null,null,null,null,null,null,null,null,null,null,null,null,null,null,null,null,null,null,null,null,null,null,null,null,null,null,null,null,null,null,null,null,null,null,null,null,null,null,null,null,null,null,null,null,null,null,null,null,null,null,null,null,null,null,null,null,null,null,null,null,null,null,{"$f":"N32","v":"1.4.1.4."}]
[null,2,{"$f":"C33","v":"G"},null,null,null,null,null,null,{"$f":"COLUMN(N34)","v":14},{"$f":"RIGHT(IF(LEN(N33)<LEN(AY33),AY33,N33),LEN(IF(LEN(N33)<LEN(AY33),AY33,N33))/2)","v":""}]
[null,2]
[null,2,null,null,"x","x","x",null,null,null,null,null,null,"1.4.2.","apgrozāmo līdzekļu uzskaite:",null,null,null,null,null,null,null,null,null,null,null,null,null,null,null,null,null,null,null,null,null,null,null,null,null,null,null,null,null,null,null,null,null,null,null,"1.4.2.","apgrozāmo līdzekļu uzskaite:"]
[null,2,{"$f":"IF(C38=\"GS\",\"S\",\"\")","v":""},null,"x","x","x",null,null,null,null,null,null,"1.4.2.1.","krājumu uzskaite",null,null,null,null,null,null,null,null,null,null,null,null,null,null,null,null,null,null,null,null,null,null,null,null,null,null,null,null,null,null,null,null,null,null,null,"1.4.2.1.","krājumu uzskaite"]
[null,2,{"$f":"IFERROR(IF(OR(N38<>\"\",AY38<>\"\"),\"GS\",\"G\"),\"GS\")","v":"G"},null,null,null,null,null,"R1040201",{"$f":"COLUMN(N38)","v":14},{"$f":"LEFT(IF(LEN(N38)<LEN(AY38),AY38,N38),LEN(IF(LEN(N38)<LEN(AY38),AY38,N38))/2)","v":""},null,null,null,null,null,null,null,null,null,null,null,null,null,null,null,null,null,null,null,null,null,null,null,null,null,null,null,null,null,null,null,null,null,null,null,null,null,null,null,null,null,null,null,null,null,null,null,null,null,null,null,null,null,null,null,null,null,null,null,null,null,null,null,null,null,null,null,null,null,null,null,null,null,null,null,{"$f":"N37","v":"1.4.2.1."}]
[null,2,{"$f":"C38","v":"G"},null,null,null,null,null,null,{"$f":"COLUMN(N39)","v":14},{"$f":"RIGHT(IF(LEN(N38)<LEN(AY38),AY38,N38),LEN(IF(LEN(N38)<LEN(AY38),AY38,N38))/2)","v":""}]
[null,2,{"$f":"IF(C41=\"GS\",\"S\",\"\")","v":""},null,"x","x","x",null,null,null,null,null,null,"1.4.2.2.","uzkrājumu veidošanas grāmatvedības politika nedrošiem parādiem",null,null,null,null,null,null,null,null,null,null,null,null,null,null,null,null,null,null,null,null,null,null,null,null,null,null,null,null,null,null,null,null,null,null,null,"1.4.2.2.","uzkrājumu veidošanas grāmatvedības politika nedrošiem parādiem"]
[null,2,{"$f":"IFERROR(IF(OR(N41<>\"\",AY41<>\"\"),\"GS\",\"G\"),\"GS\")","v":"G"},null,null,null,null,null,"R1040202",{"$f":"COLUMN(N41)","v":14},{"$f":"LEFT(IF(LEN(N41)<LEN(AY41),AY41,N41),LEN(IF(LEN(N41)<LEN(AY41),AY41,N41))/2)","v":""},null,null,null,null,null,null,null,null,null,null,null,null,null,null,null,null,null,null,null,null,null,null,null,null,null,null,null,null,null,null,null,null,null,null,null,null,null,null,null,null,null,null,null,null,null,null,null,null,null,null,null,null,null,null,null,null,null,null,null,null,null,null,null,null,null,null,null,null,null,null,null,null,null,null,null,{"$f":"N40","v":"1.4.2.2."}]
[null,2,{"$f":"C41","v":"G"},null,null,null,null,null,null,{"$f":"COLUMN(N42)","v":14},{"$f":"RIGHT(IF(LEN(N41)<LEN(AY41),AY41,N41),LEN(IF(LEN(N41)<LEN(AY41),AY41,N41))/2)","v":""}]
[null,2,{"$f":"IF(C44=\"GS\",\"S\",\"\")","v":""},null,"x","x","x",null,null,null,null,null,null,"1.4.2.3.","papildus sniegtā informācija, ja tāda ir",null,null,null,null,null,null,null,null,null,null,null,null,null,null,null,null,null,null,null,null,null,null,null,null,null,null,null,null,null,null,null,null,null,null,null,"1.4.2.3.","papildus sniegtā informācija, ja tāda ir"]
[null,2,{"$f":"IFERROR(IF(OR(N44<>\"\",AY44<>\"\"),\"GS\",\"G\"),\"GS\")","v":"G"},null,null,null,null,null,"R1040203",{"$f":"COLUMN(N44)","v":14},{"$f":"LEFT(IF(LEN(N44)<LEN(AY44),AY44,N44),LEN(IF(LEN(N44)<LEN(AY44),AY44,N44))/2)","v":""},null,null,null,null,null,null,null,null,null,null,null,null,null,null,null,null,null,null,null,null,null,null,null,null,null,null,null,null,null,null,null,null,null,null,null,null,null,null,null,null,null,null,null,null,null,null,null,null,null,null,null,null,null,null,null,null,null,null,null,null,null,null,null,null,null,null,null,null,null,null,null,null,null,null,null,{"$f":"N43","v":"1.4.2.3."}]
[null,2,{"$f":"C44","v":"G"},null,null,null,null,null,null,{"$f":"COLUMN(N45)","v":14},{"$f":"RIGHT(IF(LEN(N44)<LEN(AY44),AY44,N44),LEN(IF(LEN(N44)<LEN(AY44),AY44,N44))/2)","v":""}]
[null,2]
[null,2,{"$f":"IF(C48=\"GS\",\"S\",\"\")","v":""},null,"x","x","x",null,null,null,null,null,null,"1.4.3.","uzkrājumu veidošanas noteikumi",null,null,null,null,null,null,null,null,null,null,null,null,null,null,null,null,null,null,null,null,null,null,null,null,null,null,null,null,null,null,null,null,null,null,null,"1.4.3.","uzkrājumu veidošanas noteikumi"]
[null,2,{"$f":"IFERROR(IF(OR(N48<>\"\",AY48<>\"\"),\"GS\",\"G\"),\"GS\")","v":"G"},null,null,null,null,null,"R10403",{"$f":"COLUMN(N48)","v":14},{"$f":"LEFT(IF(LEN(N48)<LEN(AY48),AY48,N48),LEN(IF(LEN(N48)<LEN(AY48),AY48,N48))/2)","v":""},null,null,null,null,null,null,null,null,null,null,null,null,null,null,null,null,null,null,null,null,null,null,null,null,null,null,null,null,null,null,null,null,null,null,null,null,null,null,null,null,null,null,null,null,null,null,null,null,null,null,null,null,null,null,null,null,null,null,null,null,null,null,null,null,null,null,null,null,null,null,null,null,null,null,null,{"$f":"N47","v":"1.4.3."}]
[null,2,{"$f":"C48","v":"G"},null,null,null,null,null,null,{"$f":"COLUMN(N49)","v":14},{"$f":"RIGHT(IF(LEN(N48)<LEN(AY48),AY48,N48),LEN(IF(LEN(N48)<LEN(AY48),AY48,N48))/2)","v":""}]
[null,2,{"$f":"IF(C51=\"GS\",\"S\",\"\")","v":""},null,"x","x","x",null,null,null,null,null,null,"1.4.4.","kreditoru uzskaite",null,null,null,null,null,null,null,null,null,null,null,null,null,null,null,null,null,null,null,null,null,null,null,null,null,null,null,null,null,null,null,null,null,null,null,"1.4.4.","kreditoru uzskaite"]
[null,2,{"$f":"IFERROR(IF(OR(N51<>\"\",AY51<>\"\"),\"GS\",\"G\"),\"GS\")","v":"G"},null,null,null,null,null,"R10404",{"$f":"COLUMN(N51)","v":14},{"$f":"LEFT(IF(LEN(N51)<LEN(AY51),AY51,N51),LEN(IF(LEN(N51)<LEN(AY51),AY51,N51))/2)","v":""},null,null,null,null,null,null,null,null,null,null,null,null,null,null,null,null,null,null,null,null,null,null,null,null,null,null,null,null,null,null,null,null,null,null,null,null,null,null,null,null,null,null,null,null,null,null,null,null,null,null,null,null,null,null,null,null,null,null,null,null,null,null,null,null,null,null,null,null,null,null,null,null,null,null,null,{"$f":"N50","v":"1.4.4."}]
[null,2,{"$f":"C51","v":"G"},null,null,null,null,null,null,{"$f":"COLUMN(N52)","v":14},{"$f":"RIGHT(IF(LEN(N51)<LEN(AY51),AY51,N51),LEN(IF(LEN(N51)<LEN(AY51),AY51,N51))/2)","v":""}]
[null,2,{"$f":"IF(C54=\"GS\",\"S\",\"\")","v":""},null,"x","x","x",null,null,null,null,null,null,"1.4.5.","ieņēmumu atzīšanas principi",null,null,null,null,null,null,null,null,null,null,null,null,null,null,null,null,null,null,null,null,null,null,null,null,null,null,null,null,null,null,null,null,null,null,null,"1.4.5.","ieņēmumu atzīšanas principi"]
[null,2,{"$f":"IFERROR(IF(OR(N54<>\"\",AY54<>\"\"),\"GS\",\"G\"),\"GS\")","v":"G"},null,null,null,null,null,"R10405",{"$f":"COLUMN(N54)","v":14},{"$f":"LEFT(IF(LEN(N54)<LEN(AY54),AY54,N54),LEN(IF(LEN(N54)<LEN(AY54),AY54,N54))/2)","v":""},null,null,null,null,null,null,null,null,null,null,null,null,null,null,null,null,null,null,null,null,null,null,null,null,null,null,null,null,null,null,null,null,null,null,null,null,null,null,null,null,null,null,null,null,null,null,null,null,null,null,null,null,null,null,null,null,null,null,null,null,null,null,null,null,null,null,null,null,null,null,null,null,null,null,null,{"$f":"N53","v":"1.4.5."}]
[null,2,{"$f":"C54","v":"G"},null,null,null,null,null,null,{"$f":"COLUMN(N55)","v":14},{"$f":"RIGHT(IF(LEN(N54)<LEN(AY54),AY54,N54),LEN(IF(LEN(N54)<LEN(AY54),AY54,N54))/2)","v":""}]
[null,2,{"$f":"IF(C57=\"GS\",\"S\",\"\")","v":""},null,"x","x","x",null,null,null,null,null,null,"1.4.6.","ar būvdarbu līgumu saistīto ieņēmumu uzskaites principi",null,null,null,null,null,null,null,null,null,null,null,null,null,null,null,null,null,null,null,null,null,null,null,null,null,null,null,null,null,null,null,null,null,null,null,"1.4.6.","ar būvdarbu līgumu saistīto ieņēmumu uzskaites principi"]
[null,2,{"$f":"IFERROR(IF(OR(N57<>\"\",AY57<>\"\"),\"GS\",\"G\"),\"GS\")","v":"G"},null,null,null,null,null,"R10406",{"$f":"COLUMN(N57)","v":14},{"$f":"LEFT(IF(LEN(N57)<LEN(AY57),AY57,N57),LEN(IF(LEN(N57)<LEN(AY57),AY57,N57))/2)","v":""},null,null,null,null,null,null,null,null,null,null,null,null,null,null,null,null,null,null,null,null,null,null,null,null,null,null,null,null,null,null,null,null,null,null,null,null,null,null,null,null,null,null,null,null,null,null,null,null,null,null,null,null,null,null,null,null,null,null,null,null,null,null,null,null,null,null,null,null,null,null,null,null,null,null,null,{"$f":"N56","v":"1.4.6."}]
[null,2,{"$f":"C57","v":"G"},null,null,null,null,null,null,{"$f":"COLUMN(N58)","v":14},{"$f":"RIGHT(IF(LEN(N57)<LEN(AY57),AY57,N57),LEN(IF(LEN(N57)<LEN(AY57),AY57,N57))/2)","v":""}]
[null,2,{"$f":"IF(C60=\"GS\",\"S\",\"\")","v":""},null,"x","x","x",null,null,null,null,null,null,"1.4.7.","izdevumu atzīšanas principi",null,null,null,null,null,null,null,null,null,null,null,null,null,null,null,null,null,null,null,null,null,null,null,null,null,null,null,null,null,null,null,null,null,null,null,"1.4.7.","izdevumu atzīšanas principi"]
[null,2,{"$f":"IFERROR(IF(OR(N60<>\"\",AY60<>\"\"),\"GS\",\"G\"),\"GS\")","v":"G"},null,null,null,null,null,"R10407",{"$f":"COLUMN(N60)","v":14},{"$f":"LEFT(IF(LEN(N60)<LEN(AY60),AY60,N60),LEN(IF(LEN(N60)<LEN(AY60),AY60,N60))/2)","v":""},null,null,null,null,null,null,null,null,null,null,null,null,null,null,null,null,null,null,null,null,null,null,null,null,null,null,null,null,null,null,null,null,null,null,null,null,null,null,null,null,null,null,null,null,null,null,null,null,null,null,null,null,null,null,null,null,null,null,null,null,null,null,null,null,null,null,null,null,null,null,null,null,null,null,null,{"$f":"N59","v":"1.4.7."}]
[null,2,{"$f":"C60","v":"G"},null,null,null,null,null,null,{"$f":"COLUMN(N61)","v":14},{"$f":"RIGHT(IF(LEN(N60)<LEN(AY60),AY60,N60),LEN(IF(LEN(N60)<LEN(AY60),AY60,N60))/2)","v":""}]
[null,2,{"$f":"IF(C63=\"GS\",\"S\",\"\")","v":""},null,"x","x","x",null,null,null,null,null,null,"1.4.8.","papildus sniegtā informācija, ja tāda ir",null,null,null,null,null,null,null,null,null,null,null,null,null,null,null,null,null,null,null,null,null,null,null,null,null,null,null,null,null,null,null,null,null,null,null,"1.4.8.","papildus sniegtā informācija, ja tāda ir"]
[null,2,{"$f":"IFERROR(IF(OR(N63<>\"\",AY63<>\"\"),\"GS\",\"G\"),\"GS\")","v":"G"},null,null,null,null,null,"R10408",{"$f":"COLUMN(N63)","v":14},{"$f":"LEFT(IF(LEN(N63)<LEN(AY63),AY63,N63),LEN(IF(LEN(N63)<LEN(AY63),AY63,N63))/2)","v":""},null,null,null,null,null,null,null,null,null,null,null,null,null,null,null,null,null,null,null,null,null,null,null,null,null,null,null,null,null,null,null,null,null,null,null,null,null,null,null,null,null,null,null,null,null,null,null,null,null,null,null,null,null,null,null,null,null,null,null,null,null,null,null,null,null,null,null,null,null,null,null,null,null,null,null,{"$f":"N62","v":"1.4.8."}]
[null,2,{"$f":"C63","v":"G"},null,null,null,null,null,null,{"$f":"COLUMN(N64)","v":14},{"$f":"RIGHT(IF(LEN(N63)<LEN(AY63),AY63,N63),LEN(IF(LEN(N63)<LEN(AY63),AY63,N63))/2)","v":""}]
[null,1]
[null,1,{"$f":"IF(C67=\"GS\",\"S\",\"\")","v":""},"x","x","x","x",null,null,null,null,null,null,"1.5.","Detalizēta informācija par maznozīmīgām summām, kas norādītas līdzīgu finanšu informāciju apvienojošos posteņos",null,null,null,null,null,null,null,null,null,null,null,null,null,null,null,null,null,null,null,null,null,null,null,null,null,null,null,null,null,null,null,null,null,null,null,"1.5.","Detalizēta informācija par maznozīmīgām summām, kas norādītas līdzīgu finanšu informāciju apvienojošos posteņos"]
[null,1,{"$f":"IFERROR(IF(OR(N67<>\"\",AY67<>\"\"),\"GS\",\"G\"),\"GS\")","v":"G"},null,null,null,null,null,"R105",{"$f":"COLUMN(N67)","v":14},{"$f":"LEFT(IF(LEN(N67)<LEN(AY67),AY67,N67),LEN(IF(LEN(N67)<LEN(AY67),AY67,N67))/2)","v":""},null,null,null,null,null,null,null,null,null,null,null,null,null,null,null,null,null,null,null,null,null,null,null,null,null,null,null,null,null,null,null,null,null,null,null,null,null,null,null,null,null,null,null,null,null,null,null,null,null,null,null,null,null,null,null,null,null,null,null,null,null,null,null,null,null,null,null,null,null,null,null,null,null,null,null,{"$f":"N66","v":"1.5."}]
[null,1,{"$f":"C67","v":"G"},null,null,null,null,null,null,{"$f":"COLUMN(N68)","v":14},{"$f":"RIGHT(IF(LEN(N67)<LEN(AY67),AY67,N67),LEN(IF(LEN(N67)<LEN(AY67),AY67,N67))/2)","v":""}]
[null,2]
[null,2,{"$f":"IF(C71=\"GS\",\"S\",\"\")","v":""},null,"x","x","x",null,null,null,null,null,null,"1.6.","Papildinformācija, ja tāda nepieciešama skaidra un patiesa priekšstata gūšanai",null,null,null,null,null,null,null,null,null,null,null,null,null,null,null,null,null,null,null,null,null,null,null,null,null,null,null,null,null,null,null,null,null,null,null,"1.6.","Papildinformācija, ja tāda nepieciešama skaidra un patiesa priekšstata gūšanai"]
[null,2,{"$f":"IFERROR(IF(OR(N71<>\"\",AY71<>\"\"),\"GS\",\"G\"),\"GS\")","v":"G"},null,null,null,null,null,"R106",{"$f":"COLUMN(N71)","v":14},{"$f":"LEFT(IF(LEN(N71)<LEN(AY71),AY71,N71),LEN(IF(LEN(N71)<LEN(AY71),AY71,N71))/2)","v":""},null,null,null,null,null,null,null,null,null,null,null,null,null,null,null,null,null,null,null,null,null,null,null,null,null,null,null,null,null,null,null,null,null,null,null,null,null,null,null,null,null,null,null,null,null,null,null,null,null,null,null,null,null,null,null,null,null,null,null,null,null,null,null,null,null,null,null,null,null,null,null,null,null,null,null,{"$f":"N70","v":"1.6."}]
[null,2,{"$f":"C71","v":"G"},null,null,null,null,null,null,{"$f":"COLUMN(N72)","v":14},{"$f":"RIGHT(IF(LEN(N71)<LEN(AY71),AY71,N71),LEN(IF(LEN(N71)<LEN(AY71),AY71,N71))/2)","v":""}]
[null,2]
[null,2,{"$f":"IF(C75=\"GS\",\"S\",\"\")","v":""},null,"x","x","x",null,null,null,null,null,null,"1.7.","Skaidrojums par atkāpšanos no kāda likumā noteiktā finanšu pārskata posteņu atzīšanas, novērtēšanas un norādīšanas \nprincipa vai noteikumiem",null,null,null,null,null,null,null,null,null,null,null,null,null,null,null,null,null,null,null,null,null,null,null,null,null,null,null,null,null,null,null,null,null,null,null,"1.7.","Skaidrojums par atkāpšanos no kāda likumā noteiktā finanšu pārskata posteņu atzīšanas, novērtēšanas un norādīšanas \nprincipa vai noteikumiem"]
[null,2,{"$f":"IFERROR(IF(OR(N75<>\"\",AY75<>\"\"),\"GS\",\"G\"),\"GS\")","v":"G"},null,null,null,null,null,"R107",{"$f":"COLUMN(N75)","v":14},{"$f":"LEFT(IF(LEN(N75)<LEN(AY75),AY75,N75),LEN(IF(LEN(N75)<LEN(AY75),AY75,N75))/2)","v":""},null,null,null,null,null,null,null,null,null,null,null,null,null,null,null,null,null,null,null,null,null,null,null,null,null,null,null,null,null,null,null,null,null,null,null,null,null,null,null,null,null,null,null,null,null,null,null,null,null,null,null,null,null,null,null,null,null,null,null,null,null,null,null,null,null,null,null,null,null,null,null,null,null,null,null,{"$f":"N74","v":"1.7."}]
[null,2,{"$f":"C75","v":"G"},null,null,null,null,null,null,{"$f":"COLUMN(N76)","v":14},{"$f":"RIGHT(IF(LEN(N75)<LEN(AY75),AY75,N75),LEN(IF(LEN(N75)<LEN(AY75),AY75,N75))/2)","v":""}]
[null,1]
[null,1,null,"x","x","x","x",null,null,null,null,null,null,"1.8.","Bilancē neiekļautās finansiālās saistības, sniegtās garantijas, un citas iespējamās saistības (kopsumma):",null,null,null,null,null,null,null,null,null,null,null,null,null,null,null,null,null,null,null,null,null,null,null,null,null,null,null,null,null,null,null,null,null,null,null,"1.8.","Bilancē neiekļautās finansiālās saistības, sniegtās garantijas, un citas iespējamās saistības (kopsumma):"]
[null,1,{"$f":"IF(C80=\"GS\",\"S\",\"\")","v":""},"x","x","x","x",null,null,null,null,null,null,"1.8.1.","galvojumi un garantijas",null,null,null,null,null,null,null,null,null,null,null,null,null,null,null,null,null,null,null,null,null,null,null,null,null,null,null,null,null,null,null,null,null,null,null,"1.8.1.","galvojumi un garantijas"]
[null,1,{"$f":"IFERROR(IF(OR(N80<>\"\",AY80<>\"\"),\"GS\",\"G\"),\"GS\")","v":"G"},null,null,null,null,null,"R10801",{"$f":"COLUMN(N80)","v":14},{"$f":"LEFT(IF(LEN(N80)<LEN(AY80),AY80,N80),LEN(IF(LEN(N80)<LEN(AY80),AY80,N80))/2)","v":""},null,null,null,null,null,null,null,null,null,null,null,null,null,null,null,null,null,null,null,null,null,null,null,null,null,null,null,null,null,null,null,null,null,null,null,null,null,null,null,null,null,null,null,null,null,null,null,null,null,null,null,null,null,null,null,null,null,null,null,null,null,null,null,null,null,null,null,null,null,null,null,null,null,null,null,{"$f":"N79","v":"1.8.1."}]
[null,1,{"$f":"C80","v":"G"},null,null,null,null,null,null,{"$f":"COLUMN(N81)","v":14},{"$f":"RIGHT(IF(LEN(N80)<LEN(AY80),AY80,N80),LEN(IF(LEN(N80)<LEN(AY80),AY80,N80))/2)","v":""}]
[null,1,{"$f":"IF(C83=\"GS\",\"S\",\"\")","v":""},"x","x","x","x",null,null,null,null,null,null,"1.8.2.","saistības par noslēgtajiem nomas un īres līgumiem, kas ir būtiski sabiedrības darbībā",null,null,null,null,null,null,null,null,null,null,null,null,null,null,null,null,null,null,null,null,null,null,null,null,null,null,null,null,null,null,null,null,null,null,null,"1.8.2.","saistības par noslēgtajiem nomas un īres līgumiem, kas ir būtiski sabiedrības darbībā"]
[null,1,{"$f":"IFERROR(IF(OR(N83<>\"\",AY83<>\"\"),\"GS\",\"G\"),\"GS\")","v":"G"},null,null,null,null,null,"R10802",{"$f":"COLUMN(N83)","v":14},{"$f":"LEFT(IF(LEN(N83)<LEN(AY83),AY83,N83),LEN(IF(LEN(N83)<LEN(AY83),AY83,N83))/2)","v":""},null,null,null,null,null,null,null,null,null,null,null,null,null,null,null,null,null,null,null,null,null,null,null,null,null,null,null,null,null,null,null,null,null,null,null,null,null,null,null,null,null,null,null,null,null,null,null,null,null,null,null,null,null,null,null,null,null,null,null,null,null,null,null,null,null,null,null,null,null,null,null,null,null,null,null,{"$f":"N82","v":"1.8.2."}]
[null,1,{"$f":"C83","v":"G"},null,null,null,null,null,null,{"$f":"COLUMN(N84)","v":14},{"$f":"RIGHT(IF(LEN(N83)<LEN(AY83),AY83,N83),LEN(IF(LEN(N83)<LEN(AY83),AY83,N83))/2)","v":""}]
[null,1,{"$f":"IF(C86=\"GS\",\"S\",\"\")","v":""},"x","x","x","x",null,null,null,null,null,null,"1.8.3.","informācija par to, ka sabiedrības aktīvi ir ieķīlāti vai citādi apgrūtināti",null,null,null,null,null,null,null,null,null,null,null,null,null,null,null,null,null,null,null,null,null,null,null,null,null,null,null,null,null,null,null,null,null,null,null,"1.8.3.","informācija par to, ka sabiedrības aktīvi ir ieķīlāti vai citādi apgrūtināti"]
[null,1,{"$f":"IFERROR(IF(OR(N86<>\"\",AY86<>\"\"),\"GS\",\"G\"),\"GS\")","v":"G"},null,null,null,null,null,"R10803",{"$f":"COLUMN(N86)","v":14},{"$f":"LEFT(IF(LEN(N86)<LEN(AY86),AY86,N86),LEN(IF(LEN(N86)<LEN(AY86),AY86,N86))/2)","v":""},null,null,null,null,null,null,null,null,null,null,null,null,null,null,null,null,null,null,null,null,null,null,null,null,null,null,null,null,null,null,null,null,null,null,null,null,null,null,null,null,null,null,null,null,null,null,null,null,null,null,null,null,null,null,null,null,null,null,null,null,null,null,null,null,null,null,null,null,null,null,null,null,null,null,null,{"$f":"N85","v":"1.8.3."}]
[null,1,{"$f":"C86","v":"G"},null,null,null,null,null,null,{"$f":"COLUMN(N87)","v":14},{"$f":"RIGHT(IF(LEN(N86)<LEN(AY86),AY86,N86),LEN(IF(LEN(N86)<LEN(AY86),AY86,N86))/2)","v":""}]
[null,1,{"$f":"IF(C89=\"GS\",\"S\",\"\")","v":""},"x","x","x","x",null,null,null,null,null,null,"1.8.4.","saistības, kas attiecas uz pensijām",null,null,null,null,null,null,null,null,null,null,null,null,null,null,null,null,null,null,null,null,null,null,null,null,null,null,null,null,null,null,null,null,null,null,null,"1.8.4.","saistības, kas attiecas uz pensijām"]
[null,1,{"$f":"IFERROR(IF(OR(N89<>\"\",AY89<>\"\"),\"GS\",\"G\"),\"GS\")","v":"G"},null,null,null,null,null,"R10804",{"$f":"COLUMN(N89)","v":14},{"$f":"LEFT(IF(LEN(N89)<LEN(AY89),AY89,N89),LEN(IF(LEN(N89)<LEN(AY89),AY89,N89))/2)","v":""},null,null,null,null,null,null,null,null,null,null,null,null,null,null,null,null,null,null,null,null,null,null,null,null,null,null,null,null,null,null,null,null,null,null,null,null,null,null,null,null,null,null,null,null,null,null,null,null,null,null,null,null,null,null,null,null,null,null,null,null,null,null,null,null,null,null,null,null,null,null,null,null,null,null,null,{"$f":"N88","v":"1.8.4."}]
[null,1,{"$f":"C89","v":"G"},null,null,null,null,null,null,{"$f":"COLUMN(N90)","v":14},{"$f":"RIGHT(IF(LEN(N89)<LEN(AY89),AY89,N89),LEN(IF(LEN(N89)<LEN(AY89),AY89,N89))/2)","v":""}]
[null,4]
[null,4,{"$f":"IF(C93=\"\",C96,C93)","v":""},null,null,null,"x",null,null,null,null,null,null,"1.8.5.","pensijas un līdzīgas saistības pret bijušajiem pārvaldes institūciju locekļiem:",null,null,null,null,null,null,null,null,null,null,null,null,null,null,null,null,null,null,null,null,null,null,null,null,null,null,null,null,null,null,null,null,null,null,null,"1.8.5.","pensijas un līdzīgas saistības pret bijušajiem pārvaldes institūciju locekļiem:"]
[null,4,{"$f":"IF(C94=\"GS\",\"S\",\"\")","v":""},null,null,null,"x",null,null,null,null,null,null,"1.8.5.1.","padomes locekļi",null,null,null,null,null,null,null,null,null,null,null,null,null,null,null,null,null,null,null,null,null,null,null,null,null,null,null,null,null,null,null,null,null,null,null,"1.8.5.1.","padomes locekļi"]
[null,4,{"$f":"IFERROR(IF(OR(N94<>\"\",AY94<>\"\"),\"GS\",\"G\"),\"GS\")","v":"G"},null,null,null,null,null,"R1080501",{"$f":"COLUMN(N94)","v":14},{"$f":"LEFT(IF(LEN(N94)<LEN(AY94),AY94,N94),LEN(IF(LEN(N94)<LEN(AY94),AY94,N94))/2)","v":""},null,null,null,null,null,null,null,null,null,null,null,null,null,null,null,null,null,null,null,null,null,null,null,null,null,null,null,null,null,null,null,null,null,null,null,null,null,null,null,null,null,null,null,null,null,null,null,null,null,null,null,null,null,null,null,null,null,null,null,null,null,null,null,null,null,null,null,null,null,null,null,null,null,null,null,{"$f":"N93","v":"1.8.5.1."}]
[null,4,{"$f":"C94","v":"G"},null,null,null,null,null,null,{"$f":"COLUMN(N95)","v":14},{"$f":"RIGHT(IF(LEN(N94)<LEN(AY94),AY94,N94),LEN(IF(LEN(N94)<LEN(AY94),AY94,N94))/2)","v":""}]
[null,4,{"$f":"IF(C97=\"GS\",\"S\",\"\")","v":""},null,null,null,"x",null,null,null,null,null,null,"1.8.5.2.","valdes locekļi",null,null,null,null,null,null,null,null,null,null,null,null,null,null,null,null,null,null,null,null,null,null,null,null,null,null,null,null,null,null,null,null,null,null,null,"1.8.5.2.","valdes locekļi"]
[null,4,{"$f":"IFERROR(IF(OR(N97<>\"\",AY97<>\"\"),\"GS\",\"G\"),\"GS\")","v":"G"},null,null,null,null,null,"R1080502",{"$f":"COLUMN(N97)","v":14},{"$f":"LEFT(IF(LEN(N97)<LEN(AY97),AY97,N97),LEN(IF(LEN(N97)<LEN(AY97),AY97,N97))/2)","v":""},null,null,null,null,null,null,null,null,null,null,null,null,null,null,null,null,null,null,null,null,null,null,null,null,null,null,null,null,null,null,null,null,null,null,null,null,null,null,null,null,null,null,null,null,null,null,null,null,null,null,null,null,null,null,null,null,null,null,null,null,null,null,null,null,null,null,null,null,null,null,null,null,null,null,null,{"$f":"N96","v":"1.8.5.2."}]
[null,4,{"$f":"C97","v":"G"},null,null,null,null,null,null,{"$f":"COLUMN(N98)","v":14},{"$f":"RIGHT(IF(LEN(N97)<LEN(AY97),AY97,N97),LEN(IF(LEN(N97)<LEN(AY97),AY97,N97))/2)","v":""}]
[null,1]
[null,1,{"$f":"IF(C101=\"GS\",\"S\",\"\")","v":""},"x","x","x","x",null,null,null,null,null,null,"1.8.6.","saistības pret radniecīgajiem un asociētajiem uzņēmumiem",null,null,null,null,null,null,null,null,null,null,null,null,null,null,null,null,null,null,null,null,null,null,null,null,null,null,null,null,null,null,null,null,null,null,null,"1.8.6.","saistības pret radniecīgajiem un asociētajiem uzņēmumiem"]
[null,1,{"$f":"IFERROR(IF(OR(N101<>\"\",AY101<>\"\"),\"GS\",\"G\"),\"GS\")","v":"G"},null,null,null,null,null,"R10806",{"$f":"COLUMN(N101)","v":14},{"$f":"LEFT(IF(LEN(N101)<LEN(AY101),AY101,N101),LEN(IF(LEN(N101)<LEN(AY101),AY101,N101))/2)","v":""},null,null,null,null,null,null,null,null,null,null,null,null,null,null,null,null,null,null,null,null,null,null,null,null,null,null,null,null,null,null,null,null,null,null,null,null,null,null,null,null,null,null,null,null,null,null,null,null,null,null,null,null,null,null,null,null,null,null,null,null,null,null,null,null,null,null,null,null,null,null,null,null,null,null,null,{"$f":"N100","v":"1.8.6."}]
[null,1,{"$f":"C101","v":"G"},null,null,null,null,null,null,{"$f":"COLUMN(N102)","v":14},{"$f":"RIGHT(IF(LEN(N101)<LEN(AY101),AY101,N101),LEN(IF(LEN(N101)<LEN(AY101),AY101,N101))/2)","v":""}]
[null,1,{"$f":"IF(C104=\"GS\",\"S\",\"\")","v":""},"x","x","x","x",null,null,null,null,null,null,"1.8.7.","informācija par iespējamām saistībām, kas varētu rasties konkrēta pagātnes notikuma sakarā",null,null,null,null,null,null,null,null,null,null,null,null,null,null,null,null,null,null,null,null,null,null,null,null,null,null,null,null,null,null,null,null,null,null,null,"1.8.7.","informācija par iespējamām saistībām, kas varētu rasties konkrēta pagātnes notikuma sakarā"]
[null,1,{"$f":"IFERROR(IF(OR(N104<>\"\",AY104<>\"\"),\"GS\",\"G\"),\"GS\")","v":"G"},null,null,null,null,null,"R10807",{"$f":"COLUMN(N104)","v":14},{"$f":"LEFT(IF(LEN(N104)<LEN(AY104),AY104,N104),LEN(IF(LEN(N104)<LEN(AY104),AY104,N104))/2)","v":""},null,null,null,null,null,null,null,null,null,null,null,null,null,null,null,null,null,null,null,null,null,null,null,null,null,null,null,null,null,null,null,null,null,null,null,null,null,null,null,null,null,null,null,null,null,null,null,null,null,null,null,null,null,null,null,null,null,null,null,null,null,null,null,null,null,null,null,null,null,null,null,null,null,null,null,{"$f":"N103","v":"1.8.7."}]
[null,1,{"$f":"C104","v":"G"},null,null,null,null,null,null,{"$f":"COLUMN(N105)","v":14},{"$f":"RIGHT(IF(LEN(N104)<LEN(AY104),AY104,N104),LEN(IF(LEN(N104)<LEN(AY104),AY104,N104))/2)","v":""}]
[null,1,{"$f":"IF(C107=\"GS\",\"S\",\"\")","v":""},"x","x","x","x",null,null,null,null,null,null,"1.8.8.","informācija par operatīvo nomu (informāciju sniedz gan nomnieks, gan iznomātājs)",null,null,null,null,null,null,null,null,null,null,null,null,null,null,null,null,null,null,null,null,null,null,null,null,null,null,null,null,null,null,null,null,null,null,null,"1.8.8.","informācija par operatīvo nomu (informāciju sniedz gan nomnieks, gan iznomātājs)"]
[null,1,{"$f":"IFERROR(IF(OR(N107<>\"\",AY107<>\"\"),\"GS\",\"G\"),\"GS\")","v":"G"},null,null,null,null,null,"R10808",{"$f":"COLUMN(N107)","v":14},{"$f":"LEFT(IF(LEN(N107)<LEN(AY107),AY107,N107),LEN(IF(LEN(N107)<LEN(AY107),AY107,N107))/2)","v":""},null,null,null,null,null,null,null,null,null,null,null,null,null,null,null,null,null,null,null,null,null,null,null,null,null,null,null,null,null,null,null,null,null,null,null,null,null,null,null,null,null,null,null,null,null,null,null,null,null,null,null,null,null,null,null,null,null,null,null,null,null,null,null,null,null,null,null,null,null,null,null,null,null,null,null,{"$f":"N106","v":"1.8.8."}]
[null,1,{"$f":"C107","v":"G"},null,null,null,null,null,null,{"$f":"COLUMN(N108)","v":14},{"$f":"RIGHT(IF(LEN(N107)<LEN(AY107),AY107,N107),LEN(IF(LEN(N107)<LEN(AY107),AY107,N107))/2)","v":""}]
[null,1,{"$f":"IF(C110=\"GS\",\"S\",\"\")","v":""},"x","x","x","x",null,null,null,null,null,null,"1.8.9.","informācija par finanšu nomu (informāciju sniedz gan nomnieks, gan iznomātājs)",null,null,null,null,null,null,null,null,null,null,null,null,null,null,null,null,null,null,null,null,null,null,null,null,null,null,null,null,null,null,null,null,null,null,null,"1.8.9.","informācija par finanšu nomu (informāciju sniedz gan nomnieks, gan iznomātājs)"]
[null,1,{"$f":"IFERROR(IF(OR(N110<>\"\",AY110<>\"\"),\"GS\",\"G\"),\"GS\")","v":"G"},null,null,null,null,null,"R10809",{"$f":"COLUMN(N110)","v":14},{"$f":"LEFT(IF(LEN(N110)<LEN(AY110),AY110,N110),LEN(IF(LEN(N110)<LEN(AY110),AY110,N110))/2)","v":""},null,null,null,null,null,null,null,null,null,null,null,null,null,null,null,null,null,null,null,null,null,null,null,null,null,null,null,null,null,null,null,null,null,null,null,null,null,null,null,null,null,null,null,null,null,null,null,null,null,null,null,null,null,null,null,null,null,null,null,null,null,null,null,null,null,null,null,null,null,null,null,null,null,null,null,{"$f":"N109","v":"1.8.9."}]
[null,1,{"$f":"C110","v":"G"},null,null,null,null,null,null,{"$f":"COLUMN(N111)","v":14},{"$f":"RIGHT(IF(LEN(N110)<LEN(AY110),AY110,N110),LEN(IF(LEN(N110)<LEN(AY110),AY110,N110))/2)","v":""}]
[null,1,{"$f":"IF(C113=\"GS\",\"S\",\"\")","v":""},"x","x","x","x",null,null,null,null,null,null,"1.8.10.","informācija par atgriezenisko nomu",null,null,null,null,null,null,null,null,null,null,null,null,null,null,null,null,null,null,null,null,null,null,null,null,null,null,null,null,null,null,null,null,null,null,null,"1.8.10.","informācija par atgriezenisko nomu"]
[null,1,{"$f":"IFERROR(IF(OR(N113<>\"\",AY113<>\"\"),\"GS\",\"G\"),\"GS\")","v":"G"},null,null,null,null,null,"R10810",{"$f":"COLUMN(N113)","v":14},{"$f":"LEFT(IF(LEN(N113)<LEN(AY113),AY113,N113),LEN(IF(LEN(N113)<LEN(AY113),AY113,N113))/2)","v":""},null,null,null,null,null,null,null,null,null,null,null,null,null,null,null,null,null,null,null,null,null,null,null,null,null,null,null,null,null,null,null,null,null,null,null,null,null,null,null,null,null,null,null,null,null,null,null,null,null,null,null,null,null,null,null,null,null,null,null,null,null,null,null,null,null,null,null,null,null,null,null,null,null,null,null,{"$f":"N112","v":"1.8.10."}]
[null,1,{"$f":"C113","v":"G"},null,null,null,null,null,null,{"$f":"COLUMN(N114)","v":14},{"$f":"RIGHT(IF(LEN(N113)<LEN(AY113),AY113,N113),LEN(IF(LEN(N113)<LEN(AY113),AY113,N113))/2)","v":""}]
[null,1,{"$f":"IF(C116=\"GS\",\"S\",\"\")","v":""},"x","x","x","x",null,null,null,null,null,null,"1.8.11.","papildus sniegtā informācija, ja tāda ir",null,null,null,null,null,null,null,null,null,null,null,null,null,null,null,null,null,null,null,null,null,null,null,null,null,null,null,null,null,null,null,null,null,null,null,"1.8.11.","papildus sniegtā informācija, ja tāda ir"]
[null,1,{"$f":"IFERROR(IF(OR(N116<>\"\",AY116<>\"\"),\"GS\",\"G\"),\"GS\")","v":"G"},null,null,null,null,null,"R10811",{"$f":"COLUMN(N116)","v":14},{"$f":"LEFT(IF(LEN(N116)<LEN(AY116),AY116,N116),LEN(IF(LEN(N116)<LEN(AY116),AY116,N116))/2)","v":""},null,null,null,null,null,null,null,null,null,null,null,null,null,null,null,null,null,null,null,null,null,null,null,null,null,null,null,null,null,null,null,null,null,null,null,null,null,null,null,null,null,null,null,null,null,null,null,null,null,null,null,null,null,null,null,null,null,null,null,null,null,null,null,null,null,null,null,null,null,null,null,null,null,null,null,{"$f":"N115","v":"1.8.11."}]
[null,1,{"$f":"C116","v":"G"},null,null,null,null,null,null,{"$f":"COLUMN(N117)","v":14},{"$f":"RIGHT(IF(LEN(N116)<LEN(AY116),AY116,N116),LEN(IF(LEN(N116)<LEN(AY116),AY116,N116))/2)","v":""}]
[null,2]
[null,2,null,null,"x","x","x",null,null,null,null,null,null,"1.9.","Informācija par nelabvēlīgiem vai labvēlīgiem notikumiem, kas neattiecas uz pārskata gadu, bet var būtiski ietekmēt gada pārskatu lietotāju novērtējumu attiecībā uz sabiedrības līdzekļiem, saistībām, finansiālo stāvokli, peļņu vai zaudējumiem un naudas plūsmu vai lēmumu pieņemšanu nākotnē",null,null,null,null,null,null,null,null,null,null,null,null,null,null,null,null,null,null,null,null,null,null,null,null,null,null,null,null,null,null,null,null,null,null,null,"1.9.","Informācija par nelabvēlīgiem vai labvēlīgiem notikumiem, kas neattiecas uz pārskata gadu, bet var būtiski ietekmēt gada pārskatu lietotāju novērtējumu attiecībā uz sabiedrības līdzekļiem, saistībām, finansiālo stāvokli, peļņu vai zaudējumiem un naudas plūsmu vai lēmumu pieņemšanu nākotnē"]
[null,2]
[null,2,{"$f":"IFERROR(IF(OR(N121<>\"\",AY121<>\"\"),\"GS\",\"G\"),\"GS\")","v":"G"},null,null,null,null,null,"R109",{"$f":"COLUMN(N121)","v":14},{"$f":"LEFT(IF(LEN(N121)<LEN(AY121),AY121,N121),LEN(IF(LEN(N121)<LEN(AY121),AY121,N121))/2)","v":""},null,null,null,null,null,null,null,null,null,null,null,null,null,null,null,null,null,null,null,null,null,null,null,null,null,null,null,null,null,null,null,null,null,null,null,null,null,null,null,null,null,null,null,null,null,null,null,null,null,null,null,null,null,null,null,null,null,null,null,null,null,null,null,null,null,null,null,null,null,null,null,null,null,null,null,{"$f":"N119","v":"1.9."}]
[null,2,{"$f":"C121","v":"G"},null,null,null,null,null,null,{"$f":"COLUMN(N122)","v":14},{"$f":"RIGHT(IF(LEN(N121)<LEN(AY121),AY121,N121),LEN(IF(LEN(N121)<LEN(AY121),AY121,N121))/2)","v":""}]
[null,3]
[null,3,{"$f":"IF(C125=\"GS\",\"S\",\"\")","v":""},null,null,"x","x",null,null,null,null,null,null,"1.10.","Informācija par būtiskiem notikumiem, kuri nav iekļauti bilancē vai peļņas vai zaudējuma aprēķinā",null,null,null,null,null,null,null,null,null,null,null,null,null,null,null,null,null,null,null,null,null,null,null,null,null,null,null,null,null,null,null,null,null,null,null,"1.10.","Informācija par būtiskiem notikumiem, kuri nav iekļauti bilancē vai peļņas vai zaudējuma aprēķinā"]
[null,3,{"$f":"IFERROR(IF(OR(N125<>\"\",AY125<>\"\"),\"GS\",\"G\"),\"GS\")","v":"G"},null,null,null,null,null,"R110",{"$f":"COLUMN(N125)","v":14},{"$f":"LEFT(IF(LEN(N125)<LEN(AY125),AY125,N125),LEN(IF(LEN(N125)<LEN(AY125),AY125,N125))/2)","v":""},null,null,null,null,null,null,null,null,null,null,null,null,null,null,null,null,null,null,null,null,null,null,null,null,null,null,null,null,null,null,null,null,null,null,null,null,null,null,null,null,null,null,null,null,null,null,null,null,null,null,null,null,null,null,null,null,null,null,null,null,null,null,null,null,null,null,null,null,null,null,null,null,null,null,null,{"$f":"N124","v":"1.10."}]
[null,3,{"$f":"C125","v":"G"},null,null,null,null,null,null,{"$f":"COLUMN(N126)","v":14},{"$f":"RIGHT(IF(LEN(N125)<LEN(AY125),AY125,N125),LEN(IF(LEN(N125)<LEN(AY125),AY125,N125))/2)","v":""}]
[null,3]
[null,3,{"$f":"LEFT(C129&C132&C135&C138&C141&C144&C147&C150&C153,1)","v":""},null,null,"x","x",null,null,null,null,null,null,"1.11.","Informācija par bilancē neiekļautu vienošanos, kam ir ietekme sabiedrības finansiālā stāvokļa novērtēšanā:",null,null,null,null,null,null,null,null,null,null,null,null,null,null,null,null,null,null,null,null,null,null,null,null,null,null,null,null,null,null,null,null,null,null,null,"1.11.","Informācija par bilancē neiekļautu vienošanos, kam ir ietekme sabiedrības finansiālā stāvokļa novērtēšanā:"]
[null,3,{"$f":"IF(C130=\"GS\",\"S\",\"\")","v":""},null,null,"x","x",null,null,null,null,null,null,"1.11.1.","īpašiem nolūkiem dibinātu sabiedrību izveidošana vai izmantošana",null,null,null,null,null,null,null,null,null,null,null,null,null,null,null,null,null,null,null,null,null,null,null,null,null,null,null,null,null,null,null,null,null,null,null,"1.11.1.","īpašiem nolūkiem dibinātu sabiedrību izveidošana vai izmantošana"]
[null,3,{"$f":"IFERROR(IF(OR(N130<>\"\",AY130<>\"\"),\"GS\",\"G\"),\"GS\")","v":"G"},null,null,null,null,null,"R11101",{"$f":"COLUMN(N130)","v":14},{"$f":"LEFT(IF(LEN(N130)<LEN(AY130),AY130,N130),LEN(IF(LEN(N130)<LEN(AY130),AY130,N130))/2)","v":""},null,null,null,null,null,null,null,null,null,null,null,null,null,null,null,null,null,null,null,null,null,null,null,null,null,null,null,null,null,null,null,null,null,null,null,null,null,null,null,null,null,null,null,null,null,null,null,null,null,null,null,null,null,null,null,null,null,null,null,null,null,null,null,null,null,null,null,null,null,null,null,null,null,null,null,{"$f":"N129","v":"1.11.1."}]
[null,3,{"$f":"C130","v":"G"},null,null,null,null,null,null,{"$f":"COLUMN(N131)","v":14},{"$f":"RIGHT(IF(LEN(N130)<LEN(AY130),AY130,N130),LEN(IF(LEN(N130)<LEN(AY130),AY130,N130))/2)","v":""}]
[null,3,{"$f":"IF(C133=\"GS\",\"S\",\"\")","v":""},null,null,"x","x",null,null,null,null,null,null,"1.11.2.","ārzonu darbība",null,null,null,null,null,null,null,null,null,null,null,null,null,null,null,null,null,null,null,null,null,null,null,null,null,null,null,null,null,null,null,null,null,null,null,"1.11.2.","ārzonu darbība"]
[null,3,{"$f":"IFERROR(IF(OR(N133<>\"\",AY133<>\"\"),\"GS\",\"G\"),\"GS\")","v":"G"},null,null,null,null,null,"R11102",{"$f":"COLUMN(N133)","v":14},{"$f":"LEFT(IF(LEN(N133)<LEN(AY133),AY133,N133),LEN(IF(LEN(N133)<LEN(AY133),AY133,N133))/2)","v":""},null,null,null,null,null,null,null,null,null,null,null,null,null,null,null,null,null,null,null,null,null,null,null,null,null,null,null,null,null,null,null,null,null,null,null,null,null,null,null,null,null,null,null,null,null,null,null,null,null,null,null,null,null,null,null,null,null,null,null,null,null,null,null,null,null,null,null,null,null,null,null,null,null,null,null,{"$f":"N132","v":"1.11.2."}]
[null,3,{"$f":"C133","v":"G"},null,null,null,null,null,null,{"$f":"COLUMN(N134)","v":14},{"$f":"RIGHT(IF(LEN(N133)<LEN(AY133),AY133,N133),LEN(IF(LEN(N133)<LEN(AY133),AY133,N133))/2)","v":""}]
[null,3,{"$f":"IF(C136=\"GS\",\"S\",\"\")","v":""},null,null,"x","x",null,null,null,null,null,null,"1.11.3.","vienošanās par risku vai ieguvumu dalīšanu",null,null,null,null,null,null,null,null,null,null,null,null,null,null,null,null,null,null,null,null,null,null,null,null,null,null,null,null,null,null,null,null,null,null,null,"1.11.3.","vienošanās par risku vai ieguvumu dalīšanu"]
[null,3,{"$f":"IFERROR(IF(OR(N136<>\"\",AY136<>\"\"),\"GS\",\"G\"),\"GS\")","v":"G"},null,null,null,null,null,"R11103",{"$f":"COLUMN(N136)","v":14},{"$f":"LEFT(IF(LEN(N136)<LEN(AY136),AY136,N136),LEN(IF(LEN(N136)<LEN(AY136),AY136,N136))/2)","v":""},null,null,null,null,null,null,null,null,null,null,null,null,null,null,null,null,null,null,null,null,null,null,null,null,null,null,null,null,null,null,null,null,null,null,null,null,null,null,null,null,null,null,null,null,null,null,null,null,null,null,null,null,null,null,null,null,null,null,null,null,null,null,null,null,null,null,null,null,null,null,null,null,null,null,null,{"$f":"N135","v":"1.11.3."}]
[null,3,{"$f":"C136","v":"G"},null,null,null,null,null,null,{"$f":"COLUMN(N137)","v":14},{"$f":"RIGHT(IF(LEN(N136)<LEN(AY136),AY136,N136),LEN(IF(LEN(N136)<LEN(AY136),AY136,N136))/2)","v":""}]
[null,3,{"$f":"IF(C139=\"GS\",\"S\",\"\")","v":""},null,null,"x","x",null,null,null,null,null,null,"1.11.4.","kombinētie repo un pārdošanas darījumi",null,null,null,null,null,null,null,null,null,null,null,null,null,null,null,null,null,null,null,null,null,null,null,null,null,null,null,null,null,null,null,null,null,null,null,"1.11.4.","kombinētie repo un pārdošanas darījumi"]
[null,3,{"$f":"IFERROR(IF(OR(N139<>\"\",AY139<>\"\"),\"GS\",\"G\"),\"GS\")","v":"G"},null,null,null,null,null,"R11104",{"$f":"COLUMN(N139)","v":14},{"$f":"LEFT(IF(LEN(N139)<LEN(AY139),AY139,N139),LEN(IF(LEN(N139)<LEN(AY139),AY139,N139))/2)","v":""},null,null,null,null,null,null,null,null,null,null,null,null,null,null,null,null,null,null,null,null,null,null,null,null,null,null,null,null,null,null,null,null,null,null,null,null,null,null,null,null,null,null,null,null,null,null,null,null,null,null,null,null,null,null,null,null,null,null,null,null,null,null,null,null,null,null,null,null,null,null,null,null,null,null,null,{"$f":"N138","v":"1.11.4."}]
[null,3,{"$f":"C139","v":"G"},null,null,null,null,null,null,{"$f":"COLUMN(N140)","v":14},{"$f":"RIGHT(IF(LEN(N139)<LEN(AY139),AY139,N139),LEN(IF(LEN(N139)<LEN(AY139),AY139,N139))/2)","v":""}]
[null,3,{"$f":"IF(C142=\"GS\",\"S\",\"\")","v":""},null,null,"x","x",null,null,null,null,null,null,"1.11.5.","parādu faktūrkreditēšana",null,null,null,null,null,null,null,null,null,null,null,null,null,null,null,null,null,null,null,null,null,null,null,null,null,null,null,null,null,null,null,null,null,null,null,"1.11.5.","parādu faktūrkreditēšana"]
[null,3,{"$f":"IFERROR(IF(OR(N142<>\"\",AY142<>\"\"),\"GS\",\"G\"),\"GS\")","v":"G"},null,null,null,null,null,"R11105",{"$f":"COLUMN(N142)","v":14},{"$f":"LEFT(IF(LEN(N142)<LEN(AY142),AY142,N142),LEN(IF(LEN(N142)<LEN(AY142),AY142,N142))/2)","v":""},null,null,null,null,null,null,null,null,null,null,null,null,null,null,null,null,null,null,null,null,null,null,null,null,null,null,null,null,null,null,null,null,null,null,null,null,null,null,null,null,null,null,null,null,null,null,null,null,null,null,null,null,null,null,null,null,null,null,null,null,null,null,null,null,null,null,null,null,null,null,null,null,null,null,null,{"$f":"N141","v":"1.11.5."}]
[null,3,{"$f":"C142","v":"G"},null,null,null,null,null,null,{"$f":"COLUMN(N143)","v":14},{"$f":"RIGHT(IF(LEN(N142)<LEN(AY142),AY142,N142),LEN(IF(LEN(N142)<LEN(AY142),AY142,N142))/2)","v":""}]
[null,3,{"$f":"IF(C145=\"GS\",\"S\",\"\")","v":""},null,null,"x","x",null,null,null,null,null,null,"1.11.6.","konsignācijas preču līgumi",null,null,null,null,null,null,null,null,null,null,null,null,null,null,null,null,null,null,null,null,null,null,null,null,null,null,null,null,null,null,null,null,null,null,null,"1.11.6.","konsignācijas preču līgumi"]
[null,3,{"$f":"IFERROR(IF(OR(N145<>\"\",AY145<>\"\"),\"GS\",\"G\"),\"GS\")","v":"G"},null,null,null,null,null,"R11106",{"$f":"COLUMN(N145)","v":14},{"$f":"LEFT(IF(LEN(N145)<LEN(AY145),AY145,N145),LEN(IF(LEN(N145)<LEN(AY145),AY145,N145))/2)","v":""},null,null,null,null,null,null,null,null,null,null,null,null,null,null,null,null,null,null,null,null,null,null,null,null,null,null,null,null,null,null,null,null,null,null,null,null,null,null,null,null,null,null,null,null,null,null,null,null,null,null,null,null,null,null,null,null,null,null,null,null,null,null,null,null,null,null,null,null,null,null,null,null,null,null,null,{"$f":"N144","v":"1.11.6."}]
[null,3,{"$f":"C145","v":"G"},null,null,null,null,null,null,{"$f":"COLUMN(N146)","v":14},{"$f":"RIGHT(IF(LEN(N145)<LEN(AY145),AY145,N145),LEN(IF(LEN(N145)<LEN(AY145),AY145,N145))/2)","v":""}]
[null,3,{"$f":"IF(C148=\"GS\",\"S\",\"\")","v":""},null,null,"x","x",null,null,null,null,null,null,"1.11.7.","līgumdarbu piesaistīšana",null,null,null,null,null,null,null,null,null,null,null,null,null,null,null,null,null,null,null,null,null,null,null,null,null,null,null,null,null,null,null,null,null,null,null,"1.11.7.","līgumdarbu piesaistīšana"]
[null,3,{"$f":"IFERROR(IF(OR(N148<>\"\",AY148<>\"\"),\"GS\",\"G\"),\"GS\")","v":"G"},null,null,null,null,null,"R11107",{"$f":"COLUMN(N148)","v":14},{"$f":"LEFT(IF(LEN(N148)<LEN(AY148),AY148,N148),LEN(IF(LEN(N148)<LEN(AY148),AY148,N148))/2)","v":""},null,null,null,null,null,null,null,null,null,null,null,null,null,null,null,null,null,null,null,null,null,null,null,null,null,null,null,null,null,null,null,null,null,null,null,null,null,null,null,null,null,null,null,null,null,null,null,null,null,null,null,null,null,null,null,null,null,null,null,null,null,null,null,null,null,null,null,null,null,null,null,null,null,null,null,{"$f":"N147","v":"1.11.7."}]
[null,3,{"$f":"C148","v":"G"},null,null,null,null,null,null,{"$f":"COLUMN(N149)","v":14},{"$f":"RIGHT(IF(LEN(N148)<LEN(AY148),AY148,N148),LEN(IF(LEN(N148)<LEN(AY148),AY148,N148))/2)","v":""}]
[null,3,{"$f":"IF(C151=\"GS\",\"S\",\"\")","v":""},null,null,"x","x",null,null,null,null,null,null,"1.11.8.","ārpakalpojumu izmantošana",null,null,null,null,null,null,null,null,null,null,null,null,null,null,null,null,null,null,null,null,null,null,null,null,null,null,null,null,null,null,null,null,null,null,null,"1.11.8.","ārpakalpojumu izmantošana"]
[null,3,{"$f":"IFERROR(IF(OR(N151<>\"\",AY151<>\"\"),\"GS\",\"G\"),\"GS\")","v":"G"},null,null,null,null,null,"R11108",{"$f":"COLUMN(N151)","v":14},{"$f":"LEFT(IF(LEN(N151)<LEN(AY151),AY151,N151),LEN(IF(LEN(N151)<LEN(AY151),AY151,N151))/2)","v":""},null,null,null,null,null,null,null,null,null,null,null,null,null,null,null,null,null,null,null,null,null,null,null,null,null,null,null,null,null,null,null,null,null,null,null,null,null,null,null,null,null,null,null,null,null,null,null,null,null,null,null,null,null,null,null,null,null,null,null,null,null,null,null,null,null,null,null,null,null,null,null,null,null,null,null,{"$f":"N150","v":"1.11.8."}]
[null,3,{"$f":"C151","v":"G"},null,null,null,null,null,null,{"$f":"COLUMN(N152)","v":14},{"$f":"RIGHT(IF(LEN(N151)<LEN(AY151),AY151,N151),LEN(IF(LEN(N151)<LEN(AY151),AY151,N151))/2)","v":""}]
[null,3,{"$f":"IF(C154=\"GS\",\"S\",\"\")","v":""},null,null,"x","x",null,null,null,null,null,null,"1.11.9.","papildus sniegtā informācija, ja tāda ir",null,null,null,null,null,null,null,null,null,null,null,null,null,null,null,null,null,null,null,null,null,null,null,null,null,null,null,null,null,null,null,null,null,null,null,"1.11.9.","papildus sniegtā informācija, ja tāda ir"]
[null,3,{"$f":"IFERROR(IF(OR(N154<>\"\",AY154<>\"\"),\"GS\",\"G\"),\"GS\")","v":"G"},null,null,null,null,null,"R11109",{"$f":"COLUMN(N154)","v":14},{"$f":"LEFT(IF(LEN(N154)<LEN(AY154),AY154,N154),LEN(IF(LEN(N154)<LEN(AY154),AY154,N154))/2)","v":""},null,null,null,null,null,null,null,null,null,null,null,null,null,null,null,null,null,null,null,null,null,null,null,null,null,null,null,null,null,null,null,null,null,null,null,null,null,null,null,null,null,null,null,null,null,null,null,null,null,null,null,null,null,null,null,null,null,null,null,null,null,null,null,null,null,null,null,null,null,null,null,null,null,null,null,{"$f":"N153","v":"1.11.9."}]
[null,3,{"$f":"C154","v":"G"},null,null,null,null,null,null,{"$f":"COLUMN(N155)","v":14},{"$f":"RIGHT(IF(LEN(N154)<LEN(AY154),AY154,N154),LEN(IF(LEN(N154)<LEN(AY154),AY154,N154))/2)","v":""}]
[null,3,{"$f":"C157","v":""}]
[null,3,{"$f":"C158","v":""},null,null,"x","x",null,null,null,null,null,null,"1.12.","Informācija par meitas sabiedrībām",null,null,null,null,null,null,null,null,null,null,null,null,null,null,null,null,null,null,null,null,null,null,null,null,null,null,null,null,null,null,null,null,null,null,null,"1.12.","Informācija par meitas sabiedrībām"]
[null,3,{"$f":"C159","v":""},null,null,null,null,null,null,null,null,null,null,null,"Meitas sab. nosaukums",null,null,null,null,null,null,null,null,"Meitas sab. juridiskā adrese",null,null,null,null,null,null,null,"Līdzdalības daļa meitas sab. pamatkapitālā %",null,null,null,null,"Meitas sab. pašu kapitāla apmērs",null,null,null,null,"Meitas sab. peļņas vai zaudējumu apmērs",null,null,null,null,null,null,null,null,null,"Meitas sab. nosaukums",null,null,null,null,null,null,null,null,"Meitas sab. juridiskā adrese",null,null,null,null,null,null,null,"Līdzdalības daļa meitas sab. pamatkapitālā %",null,null,null,null,"Meitas sab. pašu kapitāla apmērs",null,null,null,null,"Meitas sab. peļņas vai zaudējumu apmērs"]
[null,3,{"$f":"C160","v":""}]
[null,3,{"$f":"IF(C161=\"GS\",\"S\",\"\")","v":""}]
[null,3,{"$f":"IF(OR(O161<>\"\",AZ161<>\"\"),\"GS\",\"G\")","v":"G"},null,null,null,null,null,"R112",{"$f":"COLUMN(O161)&\";\"&COLUMN(X161)&\";N:\"&COLUMN(AF161)&\";L:\"&COLUMN(AK161)&\";L:\"&COLUMN(AP161)","v":"15;24;N:32;L:37;L:42"},{"$f":"O161","v":0},null,null,1,null,null,null,null,null,null,null,null,null,null,null,null,null,null,null,null,null,null,null,null,null,null,null,null,null,null,null,null,null,null,null,null,null,null,null,null,1]
[null,3,"G",null,null,null,null,null,"R112",{"$f":"COLUMN(O162)&\";\"&COLUMN(X162)&\";N:\"&COLUMN(AF162)&\";L:\"&COLUMN(AK162)&\";L:\"&COLUMN(AP162)","v":"15;24;N:32;L:37;L:42"},0,null,null,2,null,null,null,null,null,null,null,null,null,null,null,null,null,null,null,null,null,null,null,null,null,null,null,null,null,null,null,null,null,null,null,null,null,null,null,null,2]
[null,3,"G",null,null,null,null,null,"R112","15;24;N:32;L:37;L:42",0,null,null,3,null,null,null,null,null,null,null,null,null,null,null,null,null,null,null,null,null,null,null,null,null,null,null,null,null,null,null,null,null,null,null,null,null,null,null,null,3]
[null,3,"G",null,null,null,null,null,"R112","15;24;N:32;L:37;L:42",0,null,null,4,null,null,null,null,null,null,null,null,null,null,null,null,null,null,null,null,null,null,null,null,null,null,null,null,null,null,null,null,null,null,null,null,null,null,null,null,4]
[null,3,"G",null,null,null,null,null,"R112","15;24;N:32;L:37;L:42",0,null,null,5,null,null,null,null,null,null,null,null,null,null,null,null,null,null,null,null,null,null,null,null,null,null,null,null,null,null,null,null,null,null,null,null,null,null,null,null,5]
[null,3,"G",null,null,null,null,null,"R112","15;24;N:32;L:37;L:42",0,null,null,6,null,null,null,null,null,null,null,null,null,null,null,null,null,null,null,null,null,null,null,null,null,null,null,null,null,null,null,null,null,null,null,null,null,null,null,null,6]
[null,3,"G",null,null,null,null,null,"R112","15;24;N:32;L:37;L:42",0,null,null,7,null,null,null,null,null,null,null,null,null,null,null,null,null,null,null,null,null,null,null,null,null,null,null,null,null,null,null,null,null,null,null,null,null,null,null,null,7]
[null,3,"G",null,null,null,null,null,"R112","15;24;N:32;L:37;L:42",0,null,null,8,null,null,null,null,null,null,null,null,null,null,null,null,null,null,null,null,null,null,null,null,null,null,null,null,null,null,null,null,null,null,null,null,null,null,null,null,8]
[null,3,"G",null,null,null,null,null,"R112","15;24;N:32;L:37;L:42",0,null,null,9,null,null,null,null,null,null,null,null,null,null,null,null,null,null,null,null,null,null,null,null,null,null,null,null,null,null,null,null,null,null,null,null,null,null,null,null,9]
[null,3,"G",null,null,null,null,null,"R112","15;24;N:32;L:37;L:42",0,null,null,10,null,null,null,null,null,null,null,null,null,null,null,null,null,null,null,null,null,null,null,null,null,null,null,null,null,null,null,null,null,null,null,null,null,null,null,null,10]
[null,3,{"$f":"C172","v":""}]
[null,3,{"$f":"C173","v":""},null,null,"x","x",null,null,null,null,null,null,"1.13.","Informācija par asociētajām sabiedrībām",null,null,null,null,null,null,null,null,null,null,null,null,null,null,null,null,null,null,null,null,null,null,null,null,null,null,null,null,null,null,null,null,null,null,null,"1.13.","Informācija par asociētajām sabiedrībām"]
[null,3,{"$f":"C174","v":""},null,null,null,null,null,null,null,null,null,null,null,"Asoc. sab. nosaukums",null,null,null,null,null,null,null,null,"Asoc. sab. juridiskā adrese",null,null,null,null,null,null,null,"Līdzdalības daļa asoc. sab. pamatkapitālā %",null,null,null,null,"Asoc. sab. pašu kapitāla apmērs",null,null,null,null,"Asoc. sab. peļņas vai zaudējumu apmērs",null,null,null,null,null,null,null,null,null,"Asoc. sab. nosaukums",null,null,null,null,null,null,null,null,"Asoc. sab. juridiskā adrese",null,null,null,null,null,null,null,"Līdzdalības daļa asoc. sab. pamatkapitālā %",null,null,null,null,"Asoc. sab. pašu kapitāla apmērs",null,null,null,null,"Asoc. sab. peļņas vai zaudējumu apmērs"]
[null,3,{"$f":"C175","v":""}]
[null,3,{"$f":"IF(C176=\"GS\",\"S\",\"\")","v":""}]
[null,3,{"$f":"IF(OR(O176<>\"\",AZ176<>\"\"),\"GS\",\"G\")","v":"G"},null,null,null,null,null,"R113",{"$f":"COLUMN(O176)&\";\"&COLUMN(X176)&\";N:\"&COLUMN(AF176)&\";L:\"&COLUMN(AK176)&\";L:\"&COLUMN(AP176)","v":"15;24;N:32;L:37;L:42"},{"$f":"IF(O176=\"\",AZ176,O176)","v":0},null,null,1,null,null,null,null,null,null,null,null,null,null,null,null,null,null,null,null,null,null,null,null,null,null,null,null,null,null,null,null,null,null,null,null,null,null,null,null,1]
[null,3,"G",null,null,null,null,null,"R113",{"$f":"COLUMN(O177)&\";\"&COLUMN(X177)&\";N:\"&COLUMN(AF177)&\";L:\"&COLUMN(AK177)&\";L:\"&COLUMN(AP177)","v":"15;24;N:32;L:37;L:42"},{"$f":"IF(O177=\"\",AZ177,O177)","v":0},null,null,2,null,null,null,null,null,null,null,null,null,null,null,null,null,null,null,null,null,null,null,null,null,null,null,null,null,null,null,null,null,null,null,null,null,null,null,null,2]
[null,3,"G",null,null,null,null,null,"R113","15;24;N:32;L:37;L:42",0,null,null,3,null,null,null,null,null,null,null,null,null,null,null,null,null,null,null,null,null,null,null,null,null,null,null,null,null,null,null,null,null,null,null,null,null,null,null,null,3]
[null,3,"G",null,null,null,null,null,"R113","15;24;N:32;L:37;L:42",0,null,null,4,null,null,null,null,null,null,null,null,null,null,null,null,null,null,null,null,null,null,null,null,null,null,null,null,null,null,null,null,null,null,null,null,null,null,null,null,4]
[null,3,"G",null,null,null,null,null,"R113","15;24;N:32;L:37;L:42",0,null,null,5,null,null,null,null,null,null,null,null,null,null,null,null,null,null,null,null,null,null,null,null,null,null,null,null,null,null,null,null,null,null,null,null,null,null,null,null,5]
[null,3,"G",null,null,null,null,null,"R113","15;24;N:32;L:37;L:42",0,null,null,6,null,null,null,null,null,null,null,null,null,null,null,null,null,null,null,null,null,null,null,null,null,null,null,null,null,null,null,null,null,null,null,null,null,null,null,null,6]
[null,3,"G",null,null,null,null,null,"R113","15;24;N:32;L:37;L:42",0,null,null,7,null,null,null,null,null,null,null,null,null,null,null,null,null,null,null,null,null,null,null,null,null,null,null,null,null,null,null,null,null,null,null,null,null,null,null,null,7]
[null,3,"G",null,null,null,null,null,"R113","15;24;N:32;L:37;L:42",0,null,null,8,null,null,null,null,null,null,null,null,null,null,null,null,null,null,null,null,null,null,null,null,null,null,null,null,null,null,null,null,null,null,null,null,null,null,null,null,8]
[null,3,"G",null,null,null,null,null,"R113","15;24;N:32;L:37;L:42",0,null,null,9,null,null,null,null,null,null,null,null,null,null,null,null,null,null,null,null,null,null,null,null,null,null,null,null,null,null,null,null,null,null,null,null,null,null,null,null,9]
[null,3,"G",null,null,null,null,null,"R113","15;24;N:32;L:37;L:42",0,null,null,10,null,null,null,null,null,null,null,null,null,null,null,null,null,null,null,null,null,null,null,null,null,null,null,null,null,null,null,null,null,null,null,null,null,null,null,null,10]
[null,3]
[null,3,{"$f":"IF(OR(C188=\"GS\",COUNT(AS190:AU193)),\"S\",\"\")","v":""},null,null,"x","x",null,null,null,null,null,null,"1.14.","Informācija par pārskata gada laikā parakstītajām akcijām vai daļām:",null,null,null,null,null,null,null,null,null,null,null,null,null,null,null,null,null,null,null,null,null,null,null,null,null,null,null,null,null,null,null,null,null,null,null,"1.14.","Informācija par pārskata gada laikā parakstītajām akcijām vai daļām:"]
[null,3,{"$f":"IFERROR(IF(OR(N188<>\"\",AY188<>\"\",COUNT(CD190:CF193),COUNT(AS190:AU193)),\"GS\",\"G\"),\"GS\")","v":"G"},null,null,null,null,null,"R114",{"$f":"COLUMN(N188)","v":14},{"$f":"LEFT(IF(LEN(N188)<LEN(AY188),AY188,N188),LEN(IF(LEN(N188)<LEN(AY188),AY188,N188))/2)","v":""},null,null,null,null,null,null,null,null,null,null,null,null,null,null,null,null,null,null,null,null,null,null,null,null,null,null,null,null,null,null,null,null,null,null,null,null,null,null,null,null,null,null,null,null,null,null,null,null,null,null,null,null,null,null,null,null,null,null,null,null,null,null,null,null,null,null,null,null,null,null,null,null,null,null,null,{"$f":"N187","v":"1.14."}]
[null,3,{"$f":"C188","v":"G"},null,null,null,null,null,null,{"$f":"COLUMN(N189)","v":14},{"$f":"RIGHT(IF(LEN(N188)<LEN(AY188),AY188,N188),LEN(IF(LEN(N188)<LEN(AY188),AY188,N188))/2)","v":""}]
[null,3,{"$f":"IFERROR(IF(OR(AS190<>\"\",CD190<>\"\"),\"GS\",\"G\"),\"GS\")","v":"G"},null,null,"x","x",null,"R11401",{"$f":"\"L:\"&COLUMN(AS190)","v":"L:45"},null,null,null,"1.14.1.","skaits",null,null,null,null,null,null,null,null,null,null,null,null,null,null,null,null,null,null,null,null,null,null,null,null,null,null,null,null,null,null,null,null,null,null,null,"1.14.1.","skaits"]
[null,3,{"$f":"IFERROR(IF(OR(AS191<>\"\",CD191<>\"\"),\"GS\",\"G\"),\"GS\")","v":"G"},null,null,"x","x",null,"R11402",{"$f":"\"N:\"&COLUMN(AS191)","v":"N:45"},null,null,null,"1.14.2.","nominālvērtība",null,null,null,null,null,null,null,null,null,null,null,null,null,null,null,null,null,null,null,null,null,null,null,null,null,null,null,null,null,null,null,null,null,null,null,"1.14.2.","nominālvērtība"]
[null,3,{"$f":"IFERROR(IF(OR(AS192<>\"\",CD192<>\"\"),\"GS\",\"G\"),\"GS\")","v":"G"},null,null,"x","x",null,"R11403",{"$f":"\"N:\"&COLUMN(AS192)","v":"N:45"},null,null,null,"1.14.3.","kopā",null,null,null,null,null,null,null,null,null,null,null,null,null,null,null,null,null,null,null,null,null,null,null,null,null,null,null,null,null,null,null,null,null,null,null,"1.14.3.","kopā"]
[null,3,{"$f":"IFERROR(IF(OR(AS193<>\"\",CD193<>\"\"),\"GS\",\"G\"),\"GS\")","v":"G"},null,null,"x","x",null,"R11404",{"$f":"\"L:\"&COLUMN(AS193)","v":"L:45"},null,null,null,"1.14.4.","uzskaites vērtība (jānorāda, ja nav zināms skaits un nominālvērtība)",null,null,null,null,null,null,null,null,null,null,null,null,null,null,null,null,null,null,null,null,null,null,null,null,null,null,null,null,null,null,null,null,null,null,null,"1.14.4.","uzskaites vērtība (jānorāda, ja nav zināms skaits un nominālvērtība)"]
[null,3,{"$f":"C195","v":""}]
[null,3,{"$f":"C196","v":""},null,null,"x","x",null,null,null,null,null,null,"1.15.","Informācija par kapitālsabiedrībām, kuras dalībnieks ir personālsabiedrība",null,null,null,null,null,null,null,null,null,null,null,null,null,null,null,null,null,null,null,null,null,null,null,null,null,null,null,null,null,null,null,null,null,null,null,"1.15.","Informācija par kapitālsabiedrībām, kuras dalībnieks ir personālsabiedrība"]
[null,3,{"$f":"IF(C197=\"GS\",\"S\",\"\")","v":""},null,null,null,null,null,null,null,null,null,null,null,"Veids",null,null,null,null,null,null,null,null,"Nosaukums",null,null,null,null,null,null,null,null,null,"Juridiskā adrese",null,null,null,null,null,null,null,null,null,null,null,null,null,null,null,null,null,"Veids",null,null,null,null,null,null,null,null,"Nosaukums",null,null,null,null,null,null,null,null,null,"Juridiskā adrese"]
[null,3,{"$f":"IFERROR(IF(OR(O197<>\"\",AZ197<>\"\"),\"GS\",\"G\"),\"GS\")","v":"G"},null,null,null,null,null,"R115",{"$f":"COLUMN(O197)&\";\"&COLUMN(X197)&\";\"&COLUMN(AH197)","v":"15;24;34"},null,null,null,1,null,null,null,null,null,null,null,null,null,null,null,null,null,null,null,null,null,null,null,null,null,null,null,null,null,null,null,null,null,null,null,null,null,null,null,null,1]
[null,3,"G",null,null,null,null,null,"R115","15;24;34",null,null,null,2,null,null,null,null,null,null,null,null,null,null,null,null,null,null,null,null,null,null,null,null,null,null,null,null,null,null,null,null,null,null,null,null,null,null,null,null,2]
[null,3,"G",null,null,null,null,null,"R115","15;24;34",null,null,null,3,null,null,null,null,null,null,null,null,null,null,null,null,null,null,null,null,null,null,null,null,null,null,null,null,null,null,null,null,null,null,null,null,null,null,null,null,3]
[null,3,"G",null,null,null,null,null,"R115","15;24;34",null,null,null,4,null,null,null,null,null,null,null,null,null,null,null,null,null,null,null,null,null,null,null,null,null,null,null,null,null,null,null,null,null,null,null,null,null,null,null,null,4]
[null,3,"G",null,null,null,null,null,"R115","15;24;34",null,null,null,5,null,null,null,null,null,null,null,null,null,null,null,null,null,null,null,null,null,null,null,null,null,null,null,null,null,null,null,null,null,null,null,null,null,null,null,null,5]
[null,3,"G",null,null,null,null,null,"R115","15;24;34",null,null,null,6,null,null,null,null,null,null,null,null,null,null,null,null,null,null,null,null,null,null,null,null,null,null,null,null,null,null,null,null,null,null,null,null,null,null,null,null,6]
[null,3,"G",null,null,null,null,null,"R115","15;24;34",null,null,null,7,null,null,null,null,null,null,null,null,null,null,null,null,null,null,null,null,null,null,null,null,null,null,null,null,null,null,null,null,null,null,null,null,null,null,null,null,7]
[null,3,"G",null,null,null,null,null,"R115","15;24;34",null,null,null,8,null,null,null,null,null,null,null,null,null,null,null,null,null,null,null,null,null,null,null,null,null,null,null,null,null,null,null,null,null,null,null,null,null,null,null,null,8]
[null,3,"G",null,null,null,null,null,"R115","15;24;34",null,null,null,9,null,null,null,null,null,null,null,null,null,null,null,null,null,null,null,null,null,null,null,null,null,null,null,null,null,null,null,null,null,null,null,null,null,null,null,null,9]
[null,3,"G",null,null,null,null,null,"R115","15;24;34",null,null,null,10,null,null,null,null,null,null,null,null,null,null,null,null,null,null,null,null,null,null,null,null,null,null,null,null,null,null,null,null,null,null,null,null,null,null,null,null,10]
[null,3,{"$f":"C208","v":""}]
[null,3,{"$f":"C209","v":""},null,null,"x","x",null,null,null,null,null,null,"1.16.","Informācija par koncerna mātes sabiedrībām:",null,null,null,null,null,null,null,null,null,null,null,null,null,null,null,null,null,null,null,null,null,null,null,null,null,null,null,null,null,null,null,null,null,null,null,"1.16.","Informācija par koncerna mātes sabiedrībām:"]
[null,3,{"$f":"C210","v":""},null,null,null,null,null,null,null,null,null,null,null,"mātes sabiedrība:",null,null,null,null,null,null,null,null,null,null,null,null,null,null,null,null,"mātes sabiedrības mātes sabiedrība:",null,null,null,null,null,null,null,null,null,null,null,null,null,null,null,null,null,null,null,"mātes sabiedrība:",null,null,null,null,null,null,null,null,null,null,null,null,null,null,null,null,"mātes sabiedrības mātes sabiedrība:"]
[null,3,{"$f":"C211","v":""},null,null,null,null,null,null,null,null,null,null,null,"Nosaukums \t",null,null,null,null,"Juridiskā adrese",null,null,null,"konsolidētā gada pārskata saņemšanas vieta:",null,null,null,null,null,null,null,"Nosaukums",null,null,null,"Juridiskā adrese",null,null,null,"konsolidētā gada pārskata saņemšanas vieta:",null,null,null,null,null,null,null,null,null,null,null,"Nosaukums \t",null,null,null,null,"Juridiskā adrese",null,null,null,"konsolidētā gada pārskata saņemšanas vieta:",null,null,null,null,null,null,null,"Nosaukums",null,null,null,"Juridiskā adrese",null,null,null,"konsolidētā gada pārskata saņemšanas vieta:"]
[null,3,{"$f":"C212","v":""}]
[null,3,{"$f":"IF(C213=\"GS\",\"S\",\"\")","v":""},null,null,null,null,null,null,null,null,null,null,null,null,null,null,null,null,null,null,null,null,"Institūcija",null,null,null,"Adrese",null,null,null,null,null,null,null,null,null,null,null,"Institūcija",null,null,null,"Adrese",null,null,null,null,null,null,null,null,null,null,null,null,null,null,null,null,"Institūcija",null,null,null,"Adrese",null,null,null,null,null,null,null,null,null,null,null,"Institūcija",null,null,null,"Adrese"]
[null,3,{"$f":"IFERROR(IF(OR(O213<>\"\",AZ213<>\"\"),\"GS\",\"G\"),\"GS\")","v":"G"},null,null,null,null,null,"R116",{"$f":"COLUMN(O213)&\";\"&COLUMN(T213)&\";\"&COLUMN(X213)&\";\"&COLUMN(AB213)&\";\"&COLUMN(AF213)&\";\"&COLUMN(AJ213)&\";\"&COLUMN(AN213)&\";\"&COLUMN(AR213)","v":"15;20;24;28;32;36;40;44"},{"$f":"IF(O213=\"\",AZ213,O213)","v":0},null,null,1,null,null,null,null,null,null,null,null,null,null,null,null,null,null,null,null,null,null,null,null,null,null,null,null,null,null,null,null,null,null,null,null,null,null,null,null,1]
[null,3,"G",null,null,null,null,null,"R116","15;20;24;28;32;36;40;44",0,null,null,2,null,null,null,null,null,null,null,null,null,null,null,null,null,null,null,null,null,null,null,null,null,null,null,null,null,null,null,null,null,null,null,null,null,null,null,null,2]
[null,3,"G",null,null,null,null,null,"R116","15;20;24;28;32;36;40;44",0,null,null,3,null,null,null,null,null,null,null,null,null,null,null,null,null,null,null,null,null,null,null,null,null,null,null,null,null,null,null,null,null,null,null,null,null,null,null,null,3]
[null,3,"G",null,null,null,null,null,"R116","15;20;24;28;32;36;40;44",0,null,null,4,null,null,null,null,null,null,null,null,null,null,null,null,null,null,null,null,null,null,null,null,null,null,null,null,null,null,null,null,null,null,null,null,null,null,null,null,4]
[null,3,"G",null,null,null,null,null,"R116","15;20;24;28;32;36;40;44",0,null,null,5,null,null,null,null,null,null,null,null,null,null,null,null,null,null,null,null,null,null,null,null,null,null,null,null,null,null,null,null,null,null,null,null,null,null,null,null,5]
[null,3,"G",null,null,null,null,null,"R116","15;20;24;28;32;36;40;44",0,null,null,6,null,null,null,null,null,null,null,null,null,null,null,null,null,null,null,null,null,null,null,null,null,null,null,null,null,null,null,null,null,null,null,null,null,null,null,null,6]
[null,3,"G",null,null,null,null,null,"R116","15;20;24;28;32;36;40;44",0,null,null,7,null,null,null,null,null,null,null,null,null,null,null,null,null,null,null,null,null,null,null,null,null,null,null,null,null,null,null,null,null,null,null,null,null,null,null,null,7]
[null,3,"G",null,null,null,null,null,"R116","15;20;24;28;32;36;40;44",0,null,null,8,null,null,null,null,null,null,null,null,null,null,null,null,null,null,null,null,null,null,null,null,null,null,null,null,null,null,null,null,null,null,null,null,null,null,null,null,8]
[null,3,"G",null,null,null,null,null,"R116","15;20;24;28;32;36;40;44",0,null,null,9,null,null,null,null,null,null,null,null,null,null,null,null,null,null,null,null,null,null,null,null,null,null,null,null,null,null,null,null,null,null,null,null,null,null,null,null,9]
[null,3,"G",null,null,null,null,null,"R116","15;20;24;28;32;36;40;44",0,null,null,10,null,null,null,null,null,null,null,null,null,null,null,null,null,null,null,null,null,null,null,null,null,null,null,null,null,null,null,null,null,null,null,null,null,null,null,null,10]
[null,3,{"$f":"C224","v":""}]
[null,3,{"$f":"C225","v":""},null,null,"x","x",null,null,null,null,null,null,"1.17.","Informācija par darījumiem ar saistītajām pusēm, ja tie ir būtiski un neatbilst parastajiem tirgus nosacījumiem",null,null,null,null,null,null,null,null,null,null,null,null,null,null,null,null,null,null,null,null,null,null,null,null,null,null,null,null,null,null,null,null,null,null,null,"1.17.","Informācija par darījumiem ar saistītajām pusēm, ja tie ir būtiski un neatbilst parastajiem tirgus nosacījumiem"]
[null,3,{"$f":"IF(C226=\"GS\",\"S\",\"\")","v":""},null,null,null,null,null,null,null,null,null,null,null,"Paskaidrojums par darījumu, saistīto pušu attiecību veids",null,null,null,null,null,null,null,null,null,null,null,null,null,null,null,null,null,null,null,null,null,null,null,null,null,null,null,null,"Summa",null,null,null,null,null,null,null,"Paskaidrojums par darījumu, saistīto pušu attiecību veids",null,null,null,null,null,null,null,null,null,null,null,null,null,null,null,null,null,null,null,null,null,null,null,null,null,null,null,null,"Summa"]
[null,3,{"$f":"IFERROR(IF(OR(O226<>\"\",AZ226<>\"\"),\"GS\",\"G\"),\"GS\")","v":"G"},null,null,null,null,null,"R117",{"$f":"COLUMN(O226)&\";L:\"&COLUMN(AR226)","v":"15;L:44"},{"$f":"IF(O226=\"\",AZ226,O226)","v":0},null,null,1,null,null,null,null,null,null,null,null,null,null,null,null,null,null,null,null,null,null,null,null,null,null,null,null,null,null,null,null,null,null,null,null,null,null,null,null,1]
[null,3,"G",null,null,null,null,null,"R117",{"$f":"COLUMN(O227)&\";L:\"&COLUMN(AR227)","v":"15;L:44"},0,null,null,2,null,null,null,null,null,null,null,null,null,null,null,null,null,null,null,null,null,null,null,null,null,null,null,null,null,null,null,null,null,null,null,null,null,null,null,null,2]
[null,3,"G",null,null,null,null,null,"R117","15;L:44",0,null,null,3,null,null,null,null,null,null,null,null,null,null,null,null,null,null,null,null,null,null,null,null,null,null,null,null,null,null,null,null,null,null,null,null,null,null,null,null,3]
[null,3,"G",null,null,null,null,null,"R117","15;L:44",0,null,null,4,null,null,null,null,null,null,null,null,null,null,null,null,null,null,null,null,null,null,null,null,null,null,null,null,null,null,null,null,null,null,null,null,null,null,null,null,4]
[null,3,"G",null,null,null,null,null,"R117","15;L:44",0,null,null,5,null,null,null,null,null,null,null,null,null,null,null,null,null,null,null,null,null,null,null,null,null,null,null,null,null,null,null,null,null,null,null,null,null,null,null,null,5]
[null,3,"G",null,null,null,null,null,"R117","15;L:44",0,null,null,6,null,null,null,null,null,null,null,null,null,null,null,null,null,null,null,null,null,null,null,null,null,null,null,null,null,null,null,null,null,null,null,null,null,null,null,null,6]
[null,3,"G",null,null,null,null,null,"R117","15;L:44",0,null,null,7,null,null,null,null,null,null,null,null,null,null,null,null,null,null,null,null,null,null,null,null,null,null,null,null,null,null,null,null,null,null,null,null,null,null,null,null,7]
[null,3,"G",null,null,null,null,null,"R117","15;L:44",0,null,null,8,null,null,null,null,null,null,null,null,null,null,null,null,null,null,null,null,null,null,null,null,null,null,null,null,null,null,null,null,null,null,null,null,null,null,null,null,8]
[null,3,"G",null,null,null,null,null,"R117","15;L:44",0,null,null,9,null,null,null,null,null,null,null,null,null,null,null,null,null,null,null,null,null,null,null,null,null,null,null,null,null,null,null,null,null,null,null,null,null,null,null,null,9]
[null,3,"G",null,null,null,null,null,"R117","15;L:44",0,null,null,10,null,null,null,null,null,null,null,null,null,null,null,null,null,null,null,null,null,null,null,null,null,null,null,null,null,null,null,null,null,null,null,null,null,null,null,null,10]
[null,1]
[null,1,null,"x","x","x","x",null,null,null,null,null,null,"2.","Skaidrojums par iepriekšējā gada pārskata skaitļu korekcijām",null,null,null,null,null,null,null,null,null,null,null,null,null,null,null,null,null,null,null,null,null,null,null,null,null,null,null,null,null,null,null,null,null,null,null,"2.","Skaidrojums par iepriekšējā gada pārskata skaitļu korekcijām"]
[null,1]
[null,1,{"$f":"IF(C240=\"GS\",\"S\",\"\")","v":""},"x","x","x","x",null,null,null,null,null,null,"2.1.","Paskaidrojums, ja gada pārskata dati nav bijuši savstarpēji salīdzināmi vai veiktas iepriekšējo pārskata gadu korekcijas",null,null,null,null,null,null,null,null,null,null,null,null,null,null,null,null,null,null,null,null,null,null,null,null,null,null,null,null,null,null,null,null,null,null,null,"2.1.","Paskaidrojums, ja gada pārskata dati nav bijuši savstarpēji salīdzināmi vai veiktas iepriekšējo pārskata gadu korekcijas"]
[null,1,{"$f":"IFERROR(IF(OR(N240<>\"\",AY240<>\"\",COUNT(CD242:CF245),COUNT(AS242:AU245)),\"GS\",\"G\"),\"GS\")","v":"G"},null,null,null,null,null,"R201",{"$f":"COLUMN(N240)","v":14},{"$f":"LEFT(IF(LEN(N240)<LEN(AY240),AY240,N240),LEN(IF(LEN(N240)<LEN(AY240),AY240,N240))/2)","v":""},null,null,null,null,null,null,null,null,null,null,null,null,null,null,null,null,null,null,null,null,null,null,null,null,null,null,null,null,null,null,null,null,null,null,null,null,null,null,null,null,null,null,null,null,null,null,null,null,null,null,null,null,null,null,null,null,null,null,null,null,null,null,null,null,null,null,null,null,null,null,null,null,null,null,null,{"$f":"N239","v":"2.1."}]
[null,1,{"$f":"C240","v":"G"},null,null,null,null,null,null,{"$f":"COLUMN(N241)","v":14},{"$f":"RIGHT(IF(LEN(N240)<LEN(AY240),AY240,N240),LEN(IF(LEN(N240)<LEN(AY240),AY240,N240))/2)","v":""}]
[null,2,{"$f":"C243","v":""}]
[null,2,{"$f":"C244","v":""},null,"x","x","x",null,null,null,null,null,null,"2.2.","Skaidrojums par grāmatvedības politikas maiņu, ja grāmatvedības politikas maiņas pamatojums ir izmaiņas normatīvajā regulējumā:",null,null,null,null,null,null,null,null,null,null,null,null,null,null,null,null,null,null,null,null,null,null,null,null,null,null,null,null,null,null,null,null,null,null,null,"2.2.","Skaidrojums par grāmatvedības politikas maiņu, ja grāmatvedības politikas maiņas pamatojums ir izmaiņas normatīvajā regulējumā:"]
[null,2,{"$f":"IF(C245=\"GS\",\"S\",\"\")","v":""},null,"x","x","x",null,null,null,null,null,null,"2.2.1.","ārējā normatīvā akta nosaukums",null,null,null,null,null,null,null,null,null,null,null,null,null,null,null,null,null,null,null,null,null,null,null,null,null,null,null,null,null,null,null,null,null,null,null,"2.2.1.","ārējā normatīvā akta nosaukums"]
[null,2,{"$f":"IFERROR(IF(OR(N245<>\"\",AY245<>\"\",COUNT(CD247:CF250),COUNT(AS247:AU250)),\"GS\",\"G\"),\"GS\")","v":"G"},null,null,null,null,null,"R20201",{"$f":"COLUMN(N245)","v":14},{"$f":"LEFT(IF(LEN(N245)<LEN(AY245),AY245,N245),LEN(IF(LEN(N245)<LEN(AY245),AY245,N245))/2)","v":""},null,null,null,null,null,null,null,null,null,null,null,null,null,null,null,null,null,null,null,null,null,null,null,null,null,null,null,null,null,null,null,null,null,null,null,null,null,null,null,null,null,null,null,null,null,null,null,null,null,null,null,null,null,null,null,null,null,null,null,null,null,null,null,null,null,null,null,null,null,null,null,null,null,null,null,{"$f":"N244","v":"2.2.1."}]
[null,2,{"$f":"C245","v":"G"},null,null,null,null,null,null,{"$f":"COLUMN(N246)","v":14},{"$f":"RIGHT(IF(LEN(N245)<LEN(AY245),AY245,N245),LEN(IF(LEN(N245)<LEN(AY245),AY245,N245))/2)","v":""}]
[null,2,{"$f":"IFERROR(IF(OR(AQ247<>\"\",CB247<>\"\"),\"GS\",\"G\"),\"GS\")","v":"G"},null,"x","x","x",null,"R20202",{"$f":"\"DT:\"&COLUMN(AQ247)","v":"DT:43"},null,null,null,"2.2.2.","pieņemšanas datums",null,null,null,null,null,null,null,null,null,null,null,null,null,null,null,null,null,null,null,null,null,null,null,null,null,null,null,null,null,null,null,null,null,null,null,"2.2.2.","pieņemšanas datums"]
[null,2,{"$f":"IF(C249=\"GS\",\"S\",\"\")","v":""},null,"x","x","x",null,null,null,null,null,null,"2.2.3.","paredzamā ietekme uz nākamajiem pārskata periodiem (ja grāmatvedības politikas maiņa tiks veikta saskaņā ar normatīvajā aktā noteikto pārejas kārtību)",null,null,null,null,null,null,null,null,null,null,null,null,null,null,null,null,null,null,null,null,null,null,null,null,null,null,null,null,null,null,null,null,null,null,null,"2.2.3.","paredzamā ietekme uz nākamajiem pārskata periodiem (ja grāmatvedības politikas maiņa tiks veikta saskaņā ar normatīvajā aktā noteikto pārejas kārtību)"]
[null,2,{"$f":"IFERROR(IF(OR(N249<>\"\",AY249<>\"\",COUNT(CD251:CF254),COUNT(AS251:AU254)),\"GS\",\"G\"),\"GS\")","v":"G"},null,null,null,null,null,"R20203",{"$f":"COLUMN(N249)","v":14},{"$f":"LEFT(IF(LEN(N249)<LEN(AY249),AY249,N249),LEN(IF(LEN(N249)<LEN(AY249),AY249,N249))/2)","v":""},null,null,null,null,null,null,null,null,null,null,null,null,null,null,null,null,null,null,null,null,null,null,null,null,null,null,null,null,null,null,null,null,null,null,null,null,null,null,null,null,null,null,null,null,null,null,null,null,null,null,null,null,null,null,null,null,null,null,null,null,null,null,null,null,null,null,null,null,null,null,null,null,null,null,null,{"$f":"N248","v":"2.2.3."}]
[null,2,{"$f":"C249","v":"G"},null,null,null,null,null,null,{"$f":"COLUMN(N250)","v":14},{"$f":"RIGHT(IF(LEN(N249)<LEN(AY249),AY249,N249),LEN(IF(LEN(N249)<LEN(AY249),AY249,N249))/2)","v":""}]
[null,2,{"$f":"IF(C252=\"GS\",\"S\",\"\")","v":""},null,"x","x","x",null,null,null,null,null,null,"2.2.4.","grāmatvedības politikas maiņas būtība",null,null,null,null,null,null,null,null,null,null,null,null,null,null,null,null,null,null,null,null,null,null,null,null,null,null,null,null,null,null,null,null,null,null,null,"2.2.4.","grāmatvedības politikas maiņas būtība"]
[null,2,{"$f":"IFERROR(IF(OR(N252<>\"\",AY252<>\"\",COUNT(CD254:CF257),COUNT(AS254:AU257)),\"GS\",\"G\"),\"GS\")","v":"G"},null,null,null,null,null,"R20204",{"$f":"COLUMN(N252)","v":14},{"$f":"LEFT(IF(LEN(N252)<LEN(AY252),AY252,N252),LEN(IF(LEN(N252)<LEN(AY252),AY252,N252))/2)","v":""},null,null,null,null,null,null,null,null,null,null,null,null,null,null,null,null,null,null,null,null,null,null,null,null,null,null,null,null,null,null,null,null,null,null,null,null,null,null,null,null,null,null,null,null,null,null,null,null,null,null,null,null,null,null,null,null,null,null,null,null,null,null,null,null,null,null,null,null,null,null,null,null,null,null,null,{"$f":"N251","v":"2.2.4."}]
[null,2,{"$f":"C252","v":"G"},null,null,null,null,null,null,{"$f":"COLUMN(N253)","v":14},{"$f":"RIGHT(IF(LEN(N252)<LEN(AY252),AY252,N252),LEN(IF(LEN(N252)<LEN(AY252),AY252,N252))/2)","v":""}]
[null,2,{"$f":"IF(C255=\"GS\",\"S\",\"\")","v":""},null,"x","x","x",null,null,null,null,null,null,"2.2.5.","korekciju summas, kas attiecas uz pārskata gadu un iepriekšējiem gadiem*",null,null,null,null,null,null,null,null,null,null,null,null,null,null,null,null,null,null,null,null,null,null,null,null,null,null,null,null,null,null,null,null,null,null,null,"2.2.5.","korekciju summas, kas attiecas uz pārskata gadu un iepriekšējiem gadiem*"]
[null,2,{"$f":"IFERROR(IF(OR(N255<>\"\",AY255<>\"\",COUNT(CD257:CF260),COUNT(AS257:AU260)),\"GS\",\"G\"),\"GS\")","v":"G"},null,null,null,null,null,"R20205",{"$f":"COLUMN(N255)","v":14},{"$f":"LEFT(IF(LEN(N255)<LEN(AY255),AY255,N255),LEN(IF(LEN(N255)<LEN(AY255),AY255,N255))/2)","v":""},null,null,null,null,null,null,null,null,null,null,null,null,null,null,null,null,null,null,null,null,null,null,null,null,null,null,null,null,null,null,null,null,null,null,null,null,null,null,null,null,null,null,null,null,null,null,null,null,null,null,null,null,null,null,null,null,null,null,null,null,null,null,null,null,null,null,null,null,null,null,null,null,null,null,null,{"$f":"N254","v":"2.2.5."}]
[null,2,{"$f":"C255","v":"G"},null,null,null,null,null,null,{"$f":"COLUMN(N256)","v":14},{"$f":"RIGHT(IF(LEN(N255)<LEN(AY255),AY255,N255),LEN(IF(LEN(N255)<LEN(AY255),AY255,N255))/2)","v":""}]
[null,2,{"$f":"C258","v":""},null,"x","x","x",null,null,null,null,null,null,"2.2.6.","paskaidrojoša informācija par iemesliem, ja grāmatvedības politikas maiņas ietekmi uz iepriekšējo gadu finanšu pārskata rādītājiem nav iespējams noteikt, un datums, sākot ar kuru veikta grāmatvedības politikas maiņas kopējās ietekmes noteikšana",null,null,null,null,null,null,null,null,null,null,null,null,null,null,null,null,null,null,null,null,null,null,null,null,null,null,null,null,null,null,null,null,null,null,null,"2.2.6.","paskaidrojoša informācija par iemesliem, ja grāmatvedības politikas maiņas ietekmi uz iepriekšējo gadu finanšu pārskata rādītājiem nav iespējams noteikt, un datums, sākot ar kuru veikta grāmatvedības politikas maiņas kopējās ietekmes noteikšana"]
[null,2,{"$f":"IF(C259=\"GS\",\"S\",\"\")","v":""}]
[null,2,{"$f":"IFERROR(IF(OR(N259<>\"\",AY259<>\"\",COUNT(CD261:CF264),COUNT(AS261:AU264)),\"GS\",\"G\"),\"GS\")","v":"G"},null,null,null,null,null,"R20206",{"$f":"COLUMN(N259)","v":14},{"$f":"LEFT(IF(LEN(N259)<LEN(AY259),AY259,N259),LEN(IF(LEN(N259)<LEN(AY259),AY259,N259))/2)","v":""},null,null,null,null,null,null,null,null,null,null,null,null,null,null,null,null,null,null,null,null,null,null,null,null,null,null,null,null,null,null,null,null,null,null,null,null,null,null,null,null,null,null,null,null,null,null,null,null,null,null,null,null,null,null,null,null,null,null,null,null,null,null,null,null,null,null,null,null,null,null,null,null,null,null,null,{"$f":"N257","v":"2.2.6."}]
[null,2,{"$f":"C259","v":"G"},null,null,null,null,null,null,{"$f":"COLUMN(N260)","v":14},{"$f":"RIGHT(IF(LEN(N259)<LEN(AY259),AY259,N259),LEN(IF(LEN(N259)<LEN(AY259),AY259,N259))/2)","v":""}]
[null,2,{"$f":"C262","v":""}]
[null,2,{"$f":"C263","v":""},null,"x","x","x",null,null,null,null,null,null,"2.3.","Skaidrojums par grāmatvedības politikas maiņu, ja grāmatvedības politikas maiņas pamatojums ir līdzšinējās grāmatvedības politikas neatbilstība likuma prasībai par patiesu un skaidru priekšstatu:",null,null,null,null,null,null,null,null,null,null,null,null,null,null,null,null,null,null,null,null,null,null,null,null,null,null,null,null,null,null,null,null,null,null,null,"2.3.","Skaidrojums par grāmatvedības politikas maiņu, ja grāmatvedības politikas maiņas pamatojums ir līdzšinējās grāmatvedības politikas neatbilstība likuma prasībai par patiesu un skaidru priekšstatu:"]
[null,2,{"$f":"C264","v":""}]
[null,2,{"$f":"IF(C265=\"GS\",\"S\",\"\")","v":""},null,"x","x","x",null,null,null,null,null,null,"2.3.1.","grāmatvedības politikas maiņas būtība",null,null,null,null,null,null,null,null,null,null,null,null,null,null,null,null,null,null,null,null,null,null,null,null,null,null,null,null,null,null,null,null,null,null,null,"2.3.1.","grāmatvedības politikas maiņas būtība"]
[null,2,{"$f":"IFERROR(IF(OR(N265<>\"\",AY265<>\"\",COUNT(CD267:CF270),COUNT(AS267:AU270)),\"GS\",\"G\"),\"GS\")","v":"G"},null,null,null,null,null,"R20301",{"$f":"COLUMN(N265)","v":14},{"$f":"LEFT(IF(LEN(N265)<LEN(AY265),AY265,N265),LEN(IF(LEN(N265)<LEN(AY265),AY265,N265))/2)","v":""},null,null,null,null,null,null,null,null,null,null,null,null,null,null,null,null,null,null,null,null,null,null,null,null,null,null,null,null,null,null,null,null,null,null,null,null,null,null,null,null,null,null,null,null,null,null,null,null,null,null,null,null,null,null,null,null,null,null,null,null,null,null,null,null,null,null,null,null,null,null,null,null,null,null,null,{"$f":"N264","v":"2.3.1."}]
[null,2,{"$f":"C265","v":"G"},null,null,null,null,null,null,{"$f":"COLUMN(N266)","v":14},{"$f":"RIGHT(IF(LEN(N265)<LEN(AY265),AY265,N265),LEN(IF(LEN(N265)<LEN(AY265),AY265,N265))/2)","v":""}]
[null,2,{"$f":"IF(C268=\"GS\",\"S\",\"\")","v":""},null,"x","x","x",null,null,null,null,null,null,"2.3.2.","jaunās grāmatvedības politikas atbilstības pamatojums likuma prasībai par patiesu un skaidru priekšstatu",null,null,null,null,null,null,null,null,null,null,null,null,null,null,null,null,null,null,null,null,null,null,null,null,null,null,null,null,null,null,null,null,null,null,null,"2.3.2.","jaunās grāmatvedības politikas atbilstības pamatojums likuma prasībai par patiesu un skaidru priekšstatu"]
[null,2,{"$f":"IFERROR(IF(OR(N268<>\"\",AY268<>\"\",COUNT(CD270:CF273),COUNT(AS270:AU273)),\"GS\",\"G\"),\"GS\")","v":"G"},null,null,null,null,null,"R20302",{"$f":"COLUMN(N268)","v":14},{"$f":"LEFT(IF(LEN(N268)<LEN(AY268),AY268,N268),LEN(IF(LEN(N268)<LEN(AY268),AY268,N268))/2)","v":""},null,null,null,null,null,null,null,null,null,null,null,null,null,null,null,null,null,null,null,null,null,null,null,null,null,null,null,null,null,null,null,null,null,null,null,null,null,null,null,null,null,null,null,null,null,null,null,null,null,null,null,null,null,null,null,null,null,null,null,null,null,null,null,null,null,null,null,null,null,null,null,null,null,null,null,{"$f":"N267","v":"2.3.2."}]
[null,2,{"$f":"C268","v":"G"},null,null,null,null,null,null,{"$f":"COLUMN(N269)","v":14},{"$f":"RIGHT(IF(LEN(N268)<LEN(AY268),AY268,N268),LEN(IF(LEN(N268)<LEN(AY268),AY268,N268))/2)","v":""}]
[null,2,{"$f":"IF(C271=\"GS\",\"S\",\"\")","v":""},null,"x","x","x",null,null,null,null,null,null,"2.3.3.","korekciju summas, kas attiecas uz pārskata gadu un iepriekšējiem gadiem*",null,null,null,null,null,null,null,null,null,null,null,null,null,null,null,null,null,null,null,null,null,null,null,null,null,null,null,null,null,null,null,null,null,null,null,"2.3.3.","korekciju summas, kas attiecas uz pārskata gadu un iepriekšējiem gadiem*"]
[null,2,{"$f":"IFERROR(IF(OR(N271<>\"\",AY271<>\"\",COUNT(CD273:CF276),COUNT(AS273:AU276)),\"GS\",\"G\"),\"GS\")","v":"G"},null,null,null,null,null,"R20303",{"$f":"COLUMN(N271)","v":14},{"$f":"LEFT(IF(LEN(N271)<LEN(AY271),AY271,N271),LEN(IF(LEN(N271)<LEN(AY271),AY271,N271))/2)","v":""},null,null,null,null,null,null,null,null,null,null,null,null,null,null,null,null,null,null,null,null,null,null,null,null,null,null,null,null,null,null,null,null,null,null,null,null,null,null,null,null,null,null,null,null,null,null,null,null,null,null,null,null,null,null,null,null,null,null,null,null,null,null,null,null,null,null,null,null,null,null,null,null,null,null,null,{"$f":"N270","v":"2.3.3."}]
[null,2,{"$f":"C271","v":"G"},null,null,null,null,null,null,{"$f":"COLUMN(N272)","v":14},{"$f":"RIGHT(IF(LEN(N271)<LEN(AY271),AY271,N271),LEN(IF(LEN(N271)<LEN(AY271),AY271,N271))/2)","v":""}]
[null,2,{"$f":"C274","v":""},null,"x","x","x",null,null,null,null,null,null,"2.3.4.","paskaidrojoša informācija par iemesliem, ja grāmatvedības politikas maiņas ietekmi uz iepriekšējo gadu finanšu pārskata rādītājiem nav iespējams noteikt, un datums, sākot ar kuru veikta grāmatvedības politikas maiņas kopējās ietekmes noteikšana",null,null,null,null,null,null,null,null,null,null,null,null,null,null,null,null,null,null,null,null,null,null,null,null,null,null,null,null,null,null,null,null,null,null,null,"2.3.4.","paskaidrojoša informācija par iemesliem, ja grāmatvedības politikas maiņas ietekmi uz iepriekšējo gadu finanšu pārskata rādītājiem nav iespējams noteikt, un datums, sākot ar kuru veikta grāmatvedības politikas maiņas kopējās ietekmes noteikšana"]
[null,2,{"$f":"IF(C275=\"GS\",\"S\",\"\")","v":""}]
[null,2,{"$f":"IFERROR(IF(OR(N275<>\"\",AY275<>\"\",COUNT(CD277:CF280),COUNT(AS277:AU280)),\"GS\",\"G\"),\"GS\")","v":"G"},null,null,null,null,null,"R20304",{"$f":"COLUMN(N275)","v":14},{"$f":"LEFT(IF(LEN(N275)<LEN(AY275),AY275,N275),LEN(IF(LEN(N275)<LEN(AY275),AY275,N275))/2)","v":""},null,null,null,null,null,null,null,null,null,null,null,null,null,null,null,null,null,null,null,null,null,null,null,null,null,null,null,null,null,null,null,null,null,null,null,null,null,null,null,null,null,null,null,null,null,null,null,null,null,null,null,null,null,null,null,null,null,null,null,null,null,null,null,null,null,null,null,null,null,null,null,null,null,null,null,{"$f":"N273","v":"2.3.4."}]
[null,2,{"$f":"C275","v":"G"},null,null,null,null,null,null,{"$f":"COLUMN(N276)","v":14},{"$f":"RIGHT(IF(LEN(N275)<LEN(AY275),AY275,N275),LEN(IF(LEN(N275)<LEN(AY275),AY275,N275))/2)","v":""}]
[null,4,{"$f":"IF(C278=\"GS\",\"S\",\"\")","v":""},null,null,null,"x",null,null,null,null,null,null,"2.3.5.","skaidrojums par bilances iedaļas \"Pašu kapitāls\" atlikuma vērtības izmaiņām saistībā ar grāmatvedības politikas maiņu vai iepriekšējo gadu kļūdas labošanu",null,null,null,null,null,null,null,null,null,null,null,null,null,null,null,null,null,null,null,null,null,null,null,null,null,null,null,null,null,null,null,null,null,null,null,"2.3.5.","skaidrojums par bilances iedaļas \"Pašu kapitāls\" atlikuma vērtības izmaiņām saistībā ar grāmatvedības politikas maiņu vai iepriekšējo gadu kļūdas labošanu"]
[null,4,{"$f":"IFERROR(IF(OR(N278<>\"\",AY278<>\"\",COUNT(CD280:CF283),COUNT(AS280:AU283)),\"GS\",\"G\"),\"GS\")","v":"G"},null,null,null,null,null,"R20305",{"$f":"COLUMN(N278)","v":14},{"$f":"LEFT(IF(LEN(N278)<LEN(AY278),AY278,N278),LEN(IF(LEN(N278)<LEN(AY278),AY278,N278))/2)","v":""},null,null,null,null,null,null,null,null,null,null,null,null,null,null,null,null,null,null,null,null,null,null,null,null,null,null,null,null,null,null,null,null,null,null,null,null,null,null,null,null,null,null,null,null,null,null,null,null,null,null,null,null,null,null,null,null,null,null,null,null,null,null,null,null,null,null,null,null,null,null,null,null,null,null,null,{"$f":"N277","v":"2.3.5."}]
[null,4,{"$f":"C278","v":"G"},null,null,null,null,null,null,{"$f":"COLUMN(N279)","v":14},{"$f":"RIGHT(IF(LEN(N278)<LEN(AY278),AY278,N278),LEN(IF(LEN(N278)<LEN(AY278),AY278,N278))/2)","v":""}]
[null,4,{"$f":"C281","v":""}]
[null,4,"",null,null,null,"x",null,null,null,null,null,null,"2.4.","Informācija (aplēses veids, summa) par tām grāmatvedības aplēsēm, kuru maiņa radījusi būtisku ietekmi pārskata gadā vai no kurām ir sagaidāma būtiska ietekme nākamajos pārskata gados, ja to ir iespējams noteikt, vai skaidrojums par iemesliem, kādēļ šo ietekmi nav iespējams noteikt",null,null,null,null,null,null,null,null,null,null,null,null,null,null,null,null,null,null,null,null,null,null,null,null,null,null,null,null,null,null,null,null,null,null,null,"2.4.","Informācija (aplēses veids, summa) par tām grāmatvedības aplēsēm, kuru maiņa radījusi būtisku ietekmi pārskata gadā vai no kurām ir sagaidāma būtiska ietekme nākamajos pārskata gados, ja to ir iespējams noteikt, vai skaidrojums par iemesliem, kādēļ šo ietekmi nav iespējams noteikt"]
[null,4,""]
[null,4,""]
[null,4,"",null,null,null,null,null,null,null,null,null,null,null,"Aplēses veids",null,null,null,null,null,"Korekciju summas, kas attiecas uz pārskata gadu**",null,null,null,null,"Skaidrojums par iemesliem, ja grāmatvedības aplēses ietekmi uz finanšu pārskata rādītājiem nav iespējams noteikt, un datums, sākot ar kuru veikta grāmatvedības aplēses maiņas kopējās ietekmes noteikšana",null,null,null,null,null,null,null,null,null,null,null,"Informācija par grāmatvedības aplēses maiņu saistībā ar darbuzņēmēja pieņemto darbu izpildes procenta aprēķināšanas kārtību",null,null,null,null,null,null,null,null,null,null,null,null,null,"Aplēses veids",null,null,null,null,null,"Korekciju summas, kas attiecas uz pārskata gadu**",null,null,null,null,"Skaidrojums par iemesliem, ja grāmatvedības aplēses ietekmi uz finanšu pārskata rādītājiem nav iespējams noteikt, un datums, sākot ar kuru veikta grāmatvedības aplēses maiņas kopējās ietekmes noteikšana",null,null,null,null,null,null,null,null,null,null,null,"Informācija par grāmatvedības aplēses maiņu saistībā ar darbuzņēmēja pieņemto darbu izpildes procenta aprēķināšanas kārtību"]
[null,4,{"$f":"C286","v":""}]
[null,4,{"$f":"C287","v":""}]
[null,4,{"$f":"IF(C288=\"GS\",\"S\",\"\")","v":""}]
[null,4,{"$f":"IFERROR(IF(OR(O288<>\"\",AZ288<>\"\"),\"GS\",\"G\"),\"GS\")","v":"G"},null,null,null,null,null,"R204",{"$f":"COLUMN(O288)&\";T:\"&COLUMN(U288)&\";\"&COLUMN(Z288)&\";\"&COLUMN(AL288)","v":"15;T:21;26;38"},{"$f":"IF(O288=\"\",AZ288,O288)","v":0},null,null,1,null,null,null,null,null,null,null,null,null,null,null,null,null,null,null,null,null,null,null,null,null,null,null,null,null,null,null,null,null,null,null,null,null,null,null,null,1]
[null,4,"G",null,null,null,null,null,"R204",{"$f":"COLUMN(O289)&\";T:\"&COLUMN(U289)&\";\"&COLUMN(Z289)&\";\"&COLUMN(AL289)","v":"15;T:21;26;38"},0,null,null,2,null,null,null,null,null,null,null,null,null,null,null,null,null,null,null,null,null,null,null,null,null,null,null,null,null,null,null,null,null,null,null,null,null,null,null,null,2]
[null,4,"G",null,null,null,null,null,"R204","15;T:21;26;38",0,null,null,3,null,null,null,null,null,null,null,null,null,null,null,null,null,null,null,null,null,null,null,null,null,null,null,null,null,null,null,null,null,null,null,null,null,null,null,null,3]
[null,4,"G",null,null,null,null,null,"R204","15;T:21;26;38",0,null,null,4,null,null,null,null,null,null,null,null,null,null,null,null,null,null,null,null,null,null,null,null,null,null,null,null,null,null,null,null,null,null,null,null,null,null,null,null,4]
[null,4,"G",null,null,null,null,null,"R204","15;T:21;26;38",0,null,null,5,null,null,null,null,null,null,null,null,null,null,null,null,null,null,null,null,null,null,null,null,null,null,null,null,null,null,null,null,null,null,null,null,null,null,null,null,5]
[null,4,"G",null,null,null,null,null,"R204","15;T:21;26;38",0,null,null,6,null,null,null,null,null,null,null,null,null,null,null,null,null,null,null,null,null,null,null,null,null,null,null,null,null,null,null,null,null,null,null,null,null,null,null,null,6]
[null,4,"G",null,null,null,null,null,"R204","15;T:21;26;38",0,null,null,7,null,null,null,null,null,null,null,null,null,null,null,null,null,null,null,null,null,null,null,null,null,null,null,null,null,null,null,null,null,null,null,null,null,null,null,null,7]
[null,4,"G",null,null,null,null,null,"R204","15;T:21;26;38",0,null,null,8,null,null,null,null,null,null,null,null,null,null,null,null,null,null,null,null,null,null,null,null,null,null,null,null,null,null,null,null,null,null,null,null,null,null,null,null,8]
[null,4,"G",null,null,null,null,null,"R204","15;T:21;26;38",0,null,null,9,null,null,null,null,null,null,null,null,null,null,null,null,null,null,null,null,null,null,null,null,null,null,null,null,null,null,null,null,null,null,null,null,null,null,null,null,9]
[null,4,"G",null,null,null,null,null,"R204","15;T:21;26;38",0,null,null,10,null,null,null,null,null,null,null,null,null,null,null,null,null,null,null,null,null,null,null,null,null,null,null,null,null,null,null,null,null,null,null,null,null,null,null,null,10]
[null,2]
[null,2,null,null,"x","x","x",null,null,null,null,null,null,"2.5.","Informācija par konstatētajām iepriekšējo gadu kļūdām un labojumiem",null,null,null,null,null,null,null,null,null,null,null,null,null,null,null,null,null,null,null,null,null,null,null,null,null,null,null,null,null,null,null,null,null,null,null,"2.5.","Informācija par konstatētajām iepriekšējo gadu kļūdām un labojumiem"]
[null,2,null,null,null,null,null,null,null,null,null,null,null,null,"Kļūdas būtība",null,null,null,null,null,"Korekciju summas, kas attiecas uz iepriekšējiem gadiem***",null,null,null,null,"Skaidrojums par iemesliem, ja kļūdas ietekmi uz finanšu pārskata rādītājiem nav iespējams noteikt, un datums, sākot ar kuru veikta grāmatvedības politikas maiņas kopējās ietekmes noteikšana",null,null,null,null,null,null,null,null,null,null,null,"Skaidrojums par bilances iedaļas \"Pašu kapitāls\" atlikuma vērtības izmaiņām saistībā ar iepriekšējo gadu kļūdas labošanu",null,null,null,null,null,null,null,null,null,null,null,null,null,"Kļūdas būtība",null,null,null,null,null,"Korekciju summas, kas attiecas uz iepriekšējiem gadiem***",null,null,null,null,"Skaidrojums par iemesliem, ja kļūdas ietekmi uz finanšu pārskata rādītājiem nav iespējams noteikt, un datums, sākot ar kuru veikta grāmatvedības politikas maiņas kopējās ietekmes noteikšana",null,null,null,null,null,null,null,null,null,null,null,"Skaidrojums par bilances iedaļas \"Pašu kapitāls\" atlikuma vērtības izmaiņām saistībā ar iepriekšējo gadu kļūdas labošanu"]
[null,2]
[null,2]
[null,2,{"$f":"IF(C304=\"GS\",\"S\",\"\")","v":""}]
[null,2,{"$f":"IFERROR(IF(OR(O304<>\"\",AZ304<>\"\"),\"GS\",\"G\"),\"GS\")","v":"G"},null,null,null,null,null,"R205",{"$f":"COLUMN(O304)&\";T:\"&COLUMN(U304)&\";\"&COLUMN(Z304)&\";\"&COLUMN(AL304)","v":"15;T:21;26;38"},{"$f":"IF(LEN(Z304)>LEN(AL304),Z304,AL304)","v":0},null,null,1,null,null,null,null,null,null,null,null,null,null,null,null,null,null,null,null,null,null,null,null,null,null,null,null,null,null,null,null,null,null,null,null,null,null,null,null,1]
[null,2,"G",null,null,null,null,null,"R205","15;T:21;26;38",0,null,null,2,null,null,null,null,null,null,null,null,null,null,null,null,null,null,null,null,null,null,null,null,null,null,null,null,null,null,null,null,null,null,null,null,null,null,null,null,2]
[null,2,"G",null,null,null,null,null,"R205","15;T:21;26;38",0,null,null,3,null,null,null,null,null,null,null,null,null,null,null,null,null,null,null,null,null,null,null,null,null,null,null,null,null,null,null,null,null,null,null,null,null,null,null,null,3]
[null,2,"G",null,null,null,null,null,"R205","15;T:21;26;38",0,null,null,4,null,null,null,null,null,null,null,null,null,null,null,null,null,null,null,null,null,null,null,null,null,null,null,null,null,null,null,null,null,null,null,null,null,null,null,null,4]
[null,2,"G",null,null,null,null,null,"R205","15;T:21;26;38",0,null,null,5,null,null,null,null,null,null,null,null,null,null,null,null,null,null,null,null,null,null,null,null,null,null,null,null,null,null,null,null,null,null,null,null,null,null,null,null,5]
[null,2,"G",null,null,null,null,null,"R205","15;T:21;26;38",0,null,null,6,null,null,null,null,null,null,null,null,null,null,null,null,null,null,null,null,null,null,null,null,null,null,null,null,null,null,null,null,null,null,null,null,null,null,null,null,6]
[null,2,"G",null,null,null,null,null,"R205","15;T:21;26;38",0,null,null,7,null,null,null,null,null,null,null,null,null,null,null,null,null,null,null,null,null,null,null,null,null,null,null,null,null,null,null,null,null,null,null,null,null,null,null,null,7]
[null,2,"G",null,null,null,null,null,"R205","15;T:21;26;38",0,null,null,8,null,null,null,null,null,null,null,null,null,null,null,null,null,null,null,null,null,null,null,null,null,null,null,null,null,null,null,null,null,null,null,null,null,null,null,null,8]
[null,2,"G",null,null,null,null,null,"R205","15;T:21;26;38",0,null,null,9,null,null,null,null,null,null,null,null,null,null,null,null,null,null,null,null,null,null,null,null,null,null,null,null,null,null,null,null,null,null,null,null,null,null,null,null,9]
[null,2,"G",null,null,null,null,null,"R205","15;T:21;26;38",0,null,null,10,null,null,null,null,null,null,null,null,null,null,null,null,null,null,null,null,null,null,null,null,null,null,null,null,null,null,null,null,null,null,null,null,null,null,null,null,10]
[null,1]
[null,1,null,"x","x","x","x",null,null,null,null,null,null,"3.","Skaidrojums par bilances posteņiem. Aktīvs",null,null,null,null,null,null,null,null,null,null,null,null,null,null,null,null,null,null,null,null,null,null,null,null,null,null,null,null,null,null,null,null,null,null,null,"3.","Skaidrojums par bilances posteņiem. Aktīvs"]
[null,3]
[null,3,null,null,null,"x","x",null,null,null,null,null,null,"3.1.","Skaidrojums par ilgtermiņa ieguldījuma posteņiem",null,null,null,null,null,null,null,null,null,null,null,null,null,null,null,null,null,null,null,null,null,null,null,null,null,null,null,null,null,null,null,null,null,null,null,"3.1.","Skaidrojums par ilgtermiņa ieguldījuma posteņiem"]
[null,3,null,null,null,"x","x",null,null,null,null,null,null,"3.1.1.","nemateriālie ieguldījumi:",null,null,null,null,null,null,null,null,null,null,null,null,null,null,null,null,null,null,null,null,null,null,null,null,null,null,null,null,null,null,null,null,null,null,null,"3.1.1.","nemateriālie ieguldījumi:"]
[null,3,null,null,null,"x","x",null,null,null,null,null,null,"3.1.1.1.","attīstības izmaksas (informācija par bilances posteni \"Attīstības izmaksas\")",null,null,null,null,null,null,null,null,null,null,null,null,null,null,null,null,null,null,null,null,null,null,null,null,null,null,null,null,null,null,null,null,null,null,null,"3.1.1.1.","attīstības izmaksas (informācija par bilances posteni \"Attīstības izmaksas\")"]
[null,3,null,null,null,null,null,null,null,null,null,null,null,null,"Iegādes izmaksas vai ražošanas pašizmaksa:",null,null,null,null,null,null,null,null,null,null,null,null,null,null,null,null,null,null,null,null,null,null,null,null,null,null,null,null,null,"Summa",null,null,null,null,null,null,"Iegādes izmaksas vai ražošanas pašizmaksa:",null,null,null,null,null,null,null,null,null,null,null,null,null,null,null,null,null,null,null,null,null,null,null,null,null,null,null,null,null,"Summa"]
[null,3,{"$f":"IFERROR(IF(OR(COUNT(AS321:AU322)>0,COUNT(CD321:CF322)>0),\"GS\",\"G\"),\"GS\")","v":"G"},null,null,null,null,null,"R30101010101",{"$f":"\"L:\"&COLUMN(AS321)","v":"L:45"},null,null,null,null,"pārskata gada sākumā",null,null,null,null,null,null,null,null,null,null,null,null,null,null,null,null,null,null,null,null,null,null,null,null,null,null,null,null,null,null,null,null,null,null,null,null,"pārskata gada sākumā"]
[null,3,{"$f":"C321","v":"G"},null,null,null,null,null,"R30101010102",{"$f":"\"L:\"&COLUMN(AS322)","v":"L:45"},null,null,null,null,"pārskata gada beigās",null,null,null,null,null,null,null,null,null,null,null,null,null,null,null,null,null,null,null,null,null,null,null,null,null,null,null,null,null,null,null,null,null,null,null,null,"pārskata gada beigās"]
[null,3,{"$f":"C324","v":""}]
[null,3,{"$f":"IF(C325=\"GS\",\"S\",\"\")","v":""},null,null,null,null,null,null,null,null,null,null,null,"Vērtības palielinājumi, ieskaitot uzlabojumus",null,null,null,null,null,null,null,null,null,null,null,null,null,null,null,null,null,null,null,null,null,null,null,null,null,null,null,null,null,"Summa",null,null,null,null,null,null,"Vērtības palielinājumi, ieskaitot uzlabojumus",null,null,null,null,null,null,null,null,null,null,null,null,null,null,null,null,null,null,null,null,null,null,null,null,null,null,null,null,null,"Summa"]
[null,3,{"$f":"IFERROR(IF(OR(AS325<>\"\",CD325<>\"\"),\"GS\",\"G\"),\"GS\")","v":"G"},null,null,null,null,null,"R301010102",{"$f":"COLUMN(O325)","v":15},{"$f":"LEFT(IF(O325=\"\",AZ325,O325),LEN(IF(O325=\"\",AZ325,O325))/2)","v":""},null,null,null,null,null,null,null,null,null,null,null,null,null,null,null,null,null,null,null,null,null,null,null,null,null,null,null,null,null,null,null,null,null,null,null,null,null,null,null,null,null,null,null,null,null,null,null,null,null,null,null,null,null,null,null,null,null,null,null,null,null,null,null,null,null,null,null,null,null,null,null,null,null,null,null,"x"]
[null,3,{"$f":"C325","v":"G"},null,null,null,null,-1,"R301010102Summa",{"$f":"\"L:\"&COLUMN(AS326)","v":"L:45"},{"$f":"RIGHT(IF(O325=\"\",AZ325,O325),LEN(IF(O325=\"\",AZ325,O325))/2)","v":""}]
[null,3,{"$f":"C328","v":""}]
[null,3,{"$f":"IF(C329=\"GS\",\"S\",\"\")","v":""},null,null,null,null,null,null,null,null,null,null,null,"Atsavināšana vai likvidācija pārskata gadā",null,null,null,null,null,null,null,null,null,null,null,null,null,null,null,null,null,null,null,null,null,null,null,null,null,null,null,null,null,"Summa",null,null,null,null,null,null,"Atsavināšana vai likvidācija pārskata gadā",null,null,null,null,null,null,null,null,null,null,null,null,null,null,null,null,null,null,null,null,null,null,null,null,null,null,null,null,null,"Summa"]
[null,3,{"$f":"IFERROR(IF(OR(AS329<>\"\",CD329<>\"\"),\"GS\",\"G\"),\"GS\")","v":"G"},null,null,null,null,null,"R301010103",{"$f":"COLUMN(O329)","v":15},{"$f":"LEFT(IF(O329=\"\",AZ329,O329),LEN(IF(O329=\"\",AZ329,O329))/2)","v":""},null,null,null,null,null,null,null,null,null,null,null,null,null,null,null,null,null,null,null,null,null,null,null,null,null,null,null,null,null,null,null,null,null,null,null,null,null,null,null,null,null,null,null,null,null,null,null,null,null,null,null,null,null,null,null,null,null,null,null,null,null,null,null,null,null,null,null,null,null,null,null,null,null,null,null,"x"]
[null,3,{"$f":"C329","v":"G"},null,null,null,null,-1,"R301010103Summa",{"$f":"\"L:\"&COLUMN(AS330)","v":"L:45"},{"$f":"RIGHT(IF(O329=\"\",AZ329,O329),LEN(IF(O329=\"\",AZ329,O329))/2)","v":""}]
[null,3,{"$f":"C332","v":""}]
[null,3,{"$f":"IF(C333=\"GS\",\"S\",\"\")","v":""},null,null,null,null,null,null,null,null,null,null,null,"Pārvietošana uz citu bilances posteni",null,null,null,null,null,null,null,null,null,null,null,null,null,null,null,null,null,null,null,null,null,null,null,null,null,null,null,null,null,"Summa",null,null,null,null,null,null,"Pārvietošana uz citu bilances posteni",null,null,null,null,null,null,null,null,null,null,null,null,null,null,null,null,null,null,null,null,null,null,null,null,null,null,null,null,null,"Summa"]
[null,3,{"$f":"IFERROR(IF(OR(AS333<>\"\",CD333<>\"\"),\"GS\",\"G\"),\"GS\")","v":"G"},null,null,null,null,null,"R301010104",{"$f":"COLUMN(O333)","v":15},{"$f":"LEFT(IF(O333=\"\",AZ333,O333),LEN(IF(O333=\"\",AZ333,O333))/2)","v":""},null,null,null,null,null,null,null,null,null,null,null,null,null,null,null,null,null,null,null,null,null,null,null,null,null,null,null,null,null,null,null,null,null,null,null,null,null,null,null,null,null,null,null,null,null,null,null,null,null,null,null,null,null,null,null,null,null,null,null,null,null,null,null,null,null,null,null,null,null,null,null,null,null,null,null,"x"]
[null,3,{"$f":"C333","v":"G"},null,null,null,null,-1,"R301010104Summa",{"$f":"\"L:\"&COLUMN(AS334)","v":"L:45"},{"$f":"RIGHT(IF(O333=\"\",AZ333,O333),LEN(IF(O333=\"\",AZ333,O333))/2)","v":""}]
[null,3,{"$f":"C336","v":""}]
[null,3,{"$f":"IF(C337=\"GS\",\"S\",\"\")","v":""},null,null,null,null,null,null,null,null,null,null,null,"Uzkrātās vērtības samazinājuma korekcijas:",null,null,null,null,null,null,null,null,null,null,null,null,null,null,null,null,null,null,null,null,null,null,null,null,null,null,null,null,null,"Summa",null,null,null,null,null,null,"Uzkrātās vērtības samazinājuma korekcijas:",null,null,null,null,null,null,null,null,null,null,null,null,null,null,null,null,null,null,null,null,null,null,null,null,null,null,null,null,null,"Summa"]
[null,3,{"$f":"IFERROR(IF(OR(COUNT(AS337:AU338)>0,COUNT(CD337:CF338)>0),\"GS\",\"G\"),\"GS\")","v":"G"},null,null,null,null,null,"R30101010501",{"$f":"\"L:\"&COLUMN(AS337)","v":"L:45"},null,null,null,null,"pārskata gada sākumā",null,null,null,null,null,null,null,null,null,null,null,null,null,null,null,null,null,null,null,null,null,null,null,null,null,null,null,null,null,null,null,null,null,null,null,null,"pārskata gada sākumā"]
[null,3,{"$f":"C337","v":"G"},null,null,null,null,null,"R30101010502",{"$f":"\"L:\"&COLUMN(AS338)","v":"L:45"},null,null,null,null,"pārskata gada beigās",null,null,null,null,null,null,null,null,null,null,null,null,null,null,null,null,null,null,null,null,null,null,null,null,null,null,null,null,null,null,null,null,null,null,null,null,"pārskata gada beigās"]
[null,3,{"$f":"C340","v":""}]
[null,3,{"$f":"IF(C341=\"GS\",\"S\",\"\")","v":""},null,null,null,null,null,null,null,null,null,null,null,"Pārskata gadā aprēķinātās vērtības samazinājuma korekcijas",null,null,null,null,null,null,null,null,null,null,null,null,null,null,null,null,null,null,null,null,null,null,null,null,null,null,null,null,null,"Summa",null,null,null,null,null,null,"Pārskata gadā aprēķinātās vērtības samazinājuma korekcijas",null,null,null,null,null,null,null,null,null,null,null,null,null,null,null,null,null,null,null,null,null,null,null,null,null,null,null,null,null,"Summa"]
[null,3,{"$f":"IFERROR(IF(OR(AS341<>\"\",CD341<>\"\"),\"GS\",\"G\"),\"GS\")","v":"G"},null,null,null,null,null,"R301010106",{"$f":"COLUMN(O341)","v":15},{"$f":"LEFT(IF(O341=\"\",AZ341,O341),LEN(IF(O341=\"\",AZ341,O341))/2)","v":""},null,null,null,null,null,null,null,null,null,null,null,null,null,null,null,null,null,null,null,null,null,null,null,null,null,null,null,null,null,null,null,null,null,null,null,null,null,null,null,null,null,null,null,null,null,null,null,null,null,null,null,null,null,null,null,null,null,null,null,null,null,null,null,null,null,null,null,null,null,null,null,null,null,null,null,"x"]
[null,3,{"$f":"C341","v":"G"},null,null,null,null,-1,"R301010106Summa",{"$f":"\"L:\"&COLUMN(AS342)","v":"L:45"},{"$f":"RIGHT(IF(O341=\"\",AZ341,O341),LEN(IF(O341=\"\",AZ341,O341))/2)","v":""}]
[null,3,{"$f":"C344","v":""}]
[null,3,{"$f":"IF(C345=\"GS\",\"S\",\"\")","v":""},null,null,null,null,null,null,null,null,null,null,null,"Uzkrāto vērtības samazinājuma korekciju kopsummas izmaiņas saistībā ar objekta atsavināšanu, likvidāciju vai pārvietošanu uz citu posteni",null,null,null,null,null,null,null,null,null,null,null,null,null,null,null,null,null,null,null,null,null,null,null,null,null,null,null,null,null,"Summa",null,null,null,null,null,null,"Uzkrāto vērtības samazinājuma korekciju kopsummas izmaiņas saistībā ar objekta atsavināšanu, likvidāciju vai pārvietošanu uz citu posteni",null,null,null,null,null,null,null,null,null,null,null,null,null,null,null,null,null,null,null,null,null,null,null,null,null,null,null,null,null,"Summa"]
[null,3,{"$f":"IFERROR(IF(OR(AS345<>\"\",CD345<>\"\"),\"GS\",\"G\"),\"GS\")","v":"G"},null,null,null,null,null,"R301010107",{"$f":"COLUMN(O345)","v":15},{"$f":"LEFT(IF(O345=\"\",AZ345,O345),LEN(IF(O345=\"\",AZ345,O345))/2)","v":""},null,null,null,null,null,null,null,null,null,null,null,null,null,null,null,null,null,null,null,null,null,null,null,null,null,null,null,null,null,null,null,null,null,null,null,null,null,null,null,null,null,null,null,null,null,null,null,null,null,null,null,null,null,null,null,null,null,null,null,null,null,null,null,null,null,null,null,null,null,null,null,null,null,null,null,"x"]
[null,3,{"$f":"C345","v":"G"},null,null,null,null,-1,"R301010107Summa",{"$f":"\"L:\"&COLUMN(AS346)","v":"L:45"},{"$f":"RIGHT(IF(O345=\"\",AZ345,O345),LEN(IF(O345=\"\",AZ345,O345))/2)","v":""}]
[null,3]
[null,3,null,null,null,null,null,null,"R301010108",{"$f":"\"L:\"&COLUMN(AS348)","v":"L:45"},null,null,null,null,"Objekta ražošanas pašizmaksā iekļauto aizņēmuma procentu summa",null,null,null,null,null,null,null,null,null,null,null,null,null,null,null,null,null,null,null,null,null,null,null,null,null,null,null,null,null,null,null,null,null,null,null,null,"Objekta ražošanas pašizmaksā iekļauto aizņēmuma procentu summa"]
[null,3]
[null,3,null,null,null,null,null,null,null,null,null,null,null,null,"Bilances vērtība:",null,null,null,null,null,null,null,null,null,null,null,null,null,null,null,null,null,null,null,null,null,null,null,null,null,null,null,null,null,"Summa",null,null,null,null,null,null,"Bilances vērtība:",null,null,null,null,null,null,null,null,null,null,null,null,null,null,null,null,null,null,null,null,null,null,null,null,null,null,null,null,null,"Summa"]
[null,3,{"$f":"IFERROR(IF(OR(COUNT(AS351:AU352)>0,COUNT(CD351:CF352)>0),\"GS\",\"G\"),\"GS\")","v":"G"},null,null,null,null,null,"R30101010801",{"$f":"\"L:\"&COLUMN(AS351)","v":"L:45"},null,null,null,null,"pārskata gada sākumā",null,null,null,null,null,null,null,null,null,null,null,null,null,null,null,null,null,null,null,null,null,null,null,null,null,null,null,null,null,null,null,null,null,null,null,null,"pārskata gada sākumā"]
[null,3,{"$f":"C351","v":"G"},null,null,null,null,null,"R30101010802",{"$f":"\"L:\"&COLUMN(AS352)","v":"L:45"},null,null,null,null,"pārskata gada beigās",null,null,null,null,null,null,null,null,null,null,null,null,null,null,null,null,null,null,null,null,null,null,null,null,null,null,null,null,null,null,null,null,null,null,null,null,"pārskata gada beigās"]
[null,3]
[null,3,null,null,null,"x","x",null,null,null,null,null,null,"3.1.1.2.","koncesijas, patenti, licences, preču zīmes un tamlīdzīgas tiesības (informācija par bilances posteni \"Koncepcijas, patenti, ...\")",null,null,null,null,null,null,null,null,null,null,null,null,null,null,null,null,null,null,null,null,null,null,null,null,null,null,null,null,null,null,null,null,null,null,null,"3.1.1.2.","koncesijas, patenti, licences, preču zīmes un tamlīdzīgas tiesības (informācija par bilances posteni \"Koncepcijas, patenti, ...\")"]
[null,3,null,null,null,null,null,null,null,null,null,null,null,null,"Iegādes izmaksas vai ražošanas pašizmaksa:",null,null,null,null,null,null,null,null,null,null,null,null,null,null,null,null,null,null,null,null,null,null,null,null,null,null,null,null,null,"Summa",null,null,null,null,null,null,"Iegādes izmaksas vai ražošanas pašizmaksa:",null,null,null,null,null,null,null,null,null,null,null,null,null,null,null,null,null,null,null,null,null,null,null,null,null,null,null,null,null,"Summa"]
[null,3,{"$f":"IFERROR(IF(OR(COUNT(AS356:AU357)>0,COUNT(CD356:CF357)>0),\"GS\",\"G\"),\"GS\")","v":"G"},null,null,null,null,null,"R30101020101",{"$f":"\"L:\"&COLUMN(AS356)","v":"L:45"},null,null,null,null,"pārskata gada sākumā",null,null,null,null,null,null,null,null,null,null,null,null,null,null,null,null,null,null,null,null,null,null,null,null,null,null,null,null,null,null,null,null,null,null,null,null,"pārskata gada sākumā"]
[null,3,{"$f":"C356","v":"G"},null,null,null,null,null,"R30101020102",{"$f":"\"L:\"&COLUMN(AS357)","v":"L:45"},null,null,null,null,"pārskata gada beigās",null,null,null,null,null,null,null,null,null,null,null,null,null,null,null,null,null,null,null,null,null,null,null,null,null,null,null,null,null,null,null,null,null,null,null,null,"pārskata gada beigās"]
[null,3,{"$f":"C359","v":""}]
[null,3,{"$f":"IF(C360=\"GS\",\"S\",\"\")","v":""},null,null,null,null,null,null,null,null,null,null,null,"Vērtības palielinājumi, ieskaitot uzlabojumus",null,null,null,null,null,null,null,null,null,null,null,null,null,null,null,null,null,null,null,null,null,null,null,null,null,null,null,null,null,"Summa",null,null,null,null,null,null,"Vērtības palielinājumi, ieskaitot uzlabojumus",null,null,null,null,null,null,null,null,null,null,null,null,null,null,null,null,null,null,null,null,null,null,null,null,null,null,null,null,null,"Summa"]
[null,3,{"$f":"IFERROR(IF(OR(AS360<>\"\",CD360<>\"\"),\"GS\",\"G\"),\"GS\")","v":"G"},null,null,null,null,null,"R301010202",{"$f":"COLUMN(O360)","v":15},{"$f":"LEFT(IF(O360=\"\",AZ360,O360),LEN(IF(O360=\"\",AZ360,O360))/2)","v":""},null,null,null,null,null,null,null,null,null,null,null,null,null,null,null,null,null,null,null,null,null,null,null,null,null,null,null,null,null,null,null,null,null,null,null,null,null,null,null,null,null,null,null,null,null,null,null,null,null,null,null,null,null,null,null,null,null,null,null,null,null,null,null,null,null,null,null,null,null,null,null,null,null,null,null,"x"]
[null,3,{"$f":"C360","v":"G"},null,null,null,null,-1,"R301010202Summa",{"$f":"\"L:\"&COLUMN(AS361)","v":"L:45"},{"$f":"RIGHT(IF(O360=\"\",AZ360,O360),LEN(IF(O360=\"\",AZ360,O360))/2)","v":""}]
[null,3,{"$f":"C363","v":""}]
[null,3,{"$f":"IF(C364=\"GS\",\"S\",\"\")","v":""},null,null,null,null,null,null,null,null,null,null,null,"Atsavināšana vai likvidācija pārskata gadā",null,null,null,null,null,null,null,null,null,null,null,null,null,null,null,null,null,null,null,null,null,null,null,null,null,null,null,null,null,"Summa",null,null,null,null,null,null,"Atsavināšana vai likvidācija pārskata gadā",null,null,null,null,null,null,null,null,null,null,null,null,null,null,null,null,null,null,null,null,null,null,null,null,null,null,null,null,null,"Summa"]
[null,3,{"$f":"IFERROR(IF(OR(AS364<>\"\",CD364<>\"\"),\"GS\",\"G\"),\"GS\")","v":"G"},null,null,null,null,null,"R301010203",{"$f":"COLUMN(O364)","v":15},{"$f":"LEFT(IF(O364=\"\",AZ364,O364),LEN(IF(O364=\"\",AZ364,O364))/2)","v":""},null,null,null,null,null,null,null,null,null,null,null,null,null,null,null,null,null,null,null,null,null,null,null,null,null,null,null,null,null,null,null,null,null,null,null,null,null,null,null,null,null,null,null,null,null,null,null,null,null,null,null,null,null,null,null,null,null,null,null,null,null,null,null,null,null,null,null,null,null,null,null,null,null,null,null,"x"]
[null,3,{"$f":"C364","v":"G"},null,null,null,null,-1,"R301010203Summa",{"$f":"\"L:\"&COLUMN(AS365)","v":"L:45"},{"$f":"RIGHT(IF(O364=\"\",AZ364,O364),LEN(IF(O364=\"\",AZ364,O364))/2)","v":""}]
[null,3,{"$f":"C367","v":""}]
[null,3,{"$f":"IF(C368=\"GS\",\"S\",\"\")","v":""},null,null,null,null,null,null,null,null,null,null,null,"Pārvietošana uz citu bilances posteni",null,null,null,null,null,null,null,null,null,null,null,null,null,null,null,null,null,null,null,null,null,null,null,null,null,null,null,null,null,"Summa",null,null,null,null,null,null,"Pārvietošana uz citu bilances posteni",null,null,null,null,null,null,null,null,null,null,null,null,null,null,null,null,null,null,null,null,null,null,null,null,null,null,null,null,null,"Summa"]
[null,3,{"$f":"IFERROR(IF(OR(AS368<>\"\",CD368<>\"\"),\"GS\",\"G\"),\"GS\")","v":"G"},null,null,null,null,null,"R301010204",{"$f":"COLUMN(O368)","v":15},{"$f":"LEFT(IF(O368=\"\",AZ368,O368),LEN(IF(O368=\"\",AZ368,O368))/2)","v":""},null,null,null,null,null,null,null,null,null,null,null,null,null,null,null,null,null,null,null,null,null,null,null,null,null,null,null,null,null,null,null,null,null,null,null,null,null,null,null,null,null,null,null,null,null,null,null,null,null,null,null,null,null,null,null,null,null,null,null,null,null,null,null,null,null,null,null,null,null,null,null,null,null,null,null,"x"]
[null,3,{"$f":"C368","v":"G"},null,null,null,null,-1,"R301010204Summa",{"$f":"\"L:\"&COLUMN(AS369)","v":"L:45"},{"$f":"RIGHT(IF(O368=\"\",AZ368,O368),LEN(IF(O368=\"\",AZ368,O368))/2)","v":""}]
[null,3]
[null,3,null,null,null,null,null,null,null,null,null,null,null,null,"Uzkrātās vērtības samazinājuma korekcijas:",null,null,null,null,null,null,null,null,null,null,null,null,null,null,null,null,null,null,null,null,null,null,null,null,null,null,null,null,null,"Summa",null,null,null,null,null,null,"Uzkrātās vērtības samazinājuma korekcijas:",null,null,null,null,null,null,null,null,null,null,null,null,null,null,null,null,null,null,null,null,null,null,null,null,null,null,null,null,null,"Summa"]
[null,3,{"$f":"IFERROR(IF(OR(COUNT(AS372:AU373)>0,COUNT(CD372:CF373)>0),\"GS\",\"G\"),\"GS\")","v":"G"},null,null,null,null,null,"R30101020501",{"$f":"\"L:\"&COLUMN(AS372)","v":"L:45"},null,null,null,null,"pārskata gada sākumā",null,null,null,null,null,null,null,null,null,null,null,null,null,null,null,null,null,null,null,null,null,null,null,null,null,null,null,null,null,null,null,null,null,null,null,null,"pārskata gada sākumā"]
[null,3,{"$f":"C372","v":"G"},null,null,null,null,null,"R30101020502",{"$f":"\"L:\"&COLUMN(AS373)","v":"L:45"},null,null,null,null,"pārskata gada beigās",null,null,null,null,null,null,null,null,null,null,null,null,null,null,null,null,null,null,null,null,null,null,null,null,null,null,null,null,null,null,null,null,null,null,null,null,"pārskata gada beigās"]
[null,3,{"$f":"C375","v":""}]
[null,3,{"$f":"IF(C376=\"GS\",\"S\",\"\")","v":""},null,null,null,null,null,null,null,null,null,null,null,"Pārskata gadā aprēķinātās vērtības samazinājuma korekcijas",null,null,null,null,null,null,null,null,null,null,null,null,null,null,null,null,null,null,null,null,null,null,null,null,null,null,null,null,null,"Summa",null,null,null,null,null,null,"Pārskata gadā aprēķinātās vērtības samazinājuma korekcijas",null,null,null,null,null,null,null,null,null,null,null,null,null,null,null,null,null,null,null,null,null,null,null,null,null,null,null,null,null,"Summa"]
[null,3,{"$f":"IFERROR(IF(OR(AS376<>\"\",CD376<>\"\"),\"GS\",\"G\"),\"GS\")","v":"G"},null,null,null,null,null,"R301010206",{"$f":"COLUMN(O376)","v":15},{"$f":"LEFT(IF(O376=\"\",AZ376,O376),LEN(IF(O376=\"\",AZ376,O376))/2)","v":""},null,null,null,null,null,null,null,null,null,null,null,null,null,null,null,null,null,null,null,null,null,null,null,null,null,null,null,null,null,null,null,null,null,null,null,null,null,null,null,null,null,null,null,null,null,null,null,null,null,null,null,null,null,null,null,null,null,null,null,null,null,null,null,null,null,null,null,null,null,null,null,null,null,null,null,"x"]
[null,3,{"$f":"C376","v":"G"},null,null,null,null,-1,"R301010206Summa",{"$f":"\"L:\"&COLUMN(AS377)","v":"L:45"},{"$f":"RIGHT(IF(O376=\"\",AZ376,O376),LEN(IF(O376=\"\",AZ376,O376))/2)","v":""}]
[null,3,{"$f":"C379","v":""}]
[null,3,{"$f":"IF(C380=\"GS\",\"S\",\"\")","v":""},null,null,null,null,null,null,null,null,null,null,null,"Uzkrāto vērtības samazinājuma korekciju kopsummas izmaiņas saistībā ar objekta atsavināšanu, likvidāciju vai pārvietošanu uz citu posteni",null,null,null,null,null,null,null,null,null,null,null,null,null,null,null,null,null,null,null,null,null,null,null,null,null,null,null,null,null,"Summa",null,null,null,null,null,null,"Uzkrāto vērtības samazinājuma korekciju kopsummas izmaiņas saistībā ar objekta atsavināšanu, likvidāciju vai pārvietošanu uz citu posteni",null,null,null,null,null,null,null,null,null,null,null,null,null,null,null,null,null,null,null,null,null,null,null,null,null,null,null,null,null,"Summa"]
[null,3,{"$f":"IFERROR(IF(OR(AS380<>\"\",CD380<>\"\"),\"GS\",\"G\"),\"GS\")","v":"G"},null,null,null,null,null,"R301010207",{"$f":"COLUMN(O380)","v":15},{"$f":"LEFT(IF(O380=\"\",AZ380,O380),LEN(IF(O380=\"\",AZ380,O380))/2)","v":""},null,null,null,null,null,null,null,null,null,null,null,null,null,null,null,null,null,null,null,null,null,null,null,null,null,null,null,null,null,null,null,null,null,null,null,null,null,null,null,null,null,null,null,null,null,null,null,null,null,null,null,null,null,null,null,null,null,null,null,null,null,null,null,null,null,null,null,null,null,null,null,null,null,null,null,"x"]
[null,3,{"$f":"C380","v":"G"},null,null,null,null,-1,"R301010207Summa",{"$f":"\"L:\"&COLUMN(AS381)","v":"L:45"},{"$f":"RIGHT(IF(O380=\"\",AZ380,O380),LEN(IF(O380=\"\",AZ380,O380))/2)","v":""}]
[null,3]
[null,3,null,null,null,null,null,null,"R301010208",{"$f":"\"L:\"&COLUMN(AS383)","v":"L:45"},null,null,null,null,"Objekta ražošanas pašizmaksā iekļauto aizņēmuma procentu summa",null,null,null,null,null,null,null,null,null,null,null,null,null,null,null,null,null,null,null,null,null,null,null,null,null,null,null,null,null,null,null,null,null,null,null,null,"Objekta ražošanas pašizmaksā iekļauto aizņēmuma procentu summa"]
[null,3]
[null,3,null,null,null,null,null,null,null,null,null,null,null,null,"Bilances vērtība:",null,null,null,null,null,null,null,null,null,null,null,null,null,null,null,null,null,null,null,null,null,null,null,null,null,null,null,null,null,"Summa",null,null,null,null,null,null,"Bilances vērtība:",null,null,null,null,null,null,null,null,null,null,null,null,null,null,null,null,null,null,null,null,null,null,null,null,null,null,null,null,null,"Summa"]
[null,3,{"$f":"IFERROR(IF(OR(COUNT(AS386:AU387)>0,COUNT(CD386:CF387)>0),\"GS\",\"G\"),\"GS\")","v":"G"},null,null,null,null,null,"R30101020801",{"$f":"\"L:\"&COLUMN(AS386)","v":"L:45"},null,null,null,null,"pārskata gada sākumā",null,null,null,null,null,null,null,null,null,null,null,null,null,null,null,null,null,null,null,null,null,null,null,null,null,null,null,null,null,null,null,null,null,null,null,null,"pārskata gada sākumā"]
[null,3,{"$f":"C386","v":"G"},null,null,null,null,null,"R30101020802",{"$f":"\"L:\"&COLUMN(AS387)","v":"L:45"},null,null,null,null,"pārskata gada beigās",null,null,null,null,null,null,null,null,null,null,null,null,null,null,null,null,null,null,null,null,null,null,null,null,null,null,null,null,null,null,null,null,null,null,null,null,"pārskata gada beigās"]
[null,3]
[null,3,null,null,null,"x","x",null,null,null,null,null,null,"3.1.1.3."," citi nemateriālie ieguldījumi (informācija par bilances posteni \"Citi nemateriālie ieguldījumi\")",null,null,null,null,null,null,null,null,null,null,null,null,null,null,null,null,null,null,null,null,null,null,null,null,null,null,null,null,null,null,null,null,null,null,null,"3.1.1.3."," citi nemateriālie ieguldījumi (informācija par bilances posteni \"Citi nemateriālie ieguldījumi\")"]
[null,3,null,null,null,null,null,null,null,null,null,null,null,null,"Iegādes izmaksas vai ražošanas pašizmaksa:",null,null,null,null,null,null,null,null,null,null,null,null,null,null,null,null,null,null,null,null,null,null,null,null,null,null,null,null,null,"Summa",null,null,null,null,null,null,"Iegādes izmaksas vai ražošanas pašizmaksa:",null,null,null,null,null,null,null,null,null,null,null,null,null,null,null,null,null,null,null,null,null,null,null,null,null,null,null,null,null,"Summa"]
[null,3,{"$f":"IFERROR(IF(OR(COUNT(AS391:AU392)>0,COUNT(CD391:CF392)>0),\"GS\",\"G\"),\"GS\")","v":"G"},null,null,null,null,null,"R30101030101",{"$f":"\"L:\"&COLUMN(AS391)","v":"L:45"},null,null,null,null,"pārskata gada sākumā",null,null,null,null,null,null,null,null,null,null,null,null,null,null,null,null,null,null,null,null,null,null,null,null,null,null,null,null,null,null,null,null,null,null,null,null,"pārskata gada sākumā"]
[null,3,{"$f":"C391","v":"G"},null,null,null,null,null,"R30101030102",{"$f":"\"L:\"&COLUMN(AS392)","v":"L:45"},null,null,null,null,"pārskata gada beigās",null,null,null,null,null,null,null,null,null,null,null,null,null,null,null,null,null,null,null,null,null,null,null,null,null,null,null,null,null,null,null,null,null,null,null,null,"pārskata gada beigās"]
[null,3,{"$f":"C394","v":""}]
[null,3,{"$f":"IF(C395=\"GS\",\"S\",\"\")","v":""},null,null,null,null,null,null,null,null,null,null,null,"Vērtības palielinājumi, ieskaitot uzlabojumus",null,null,null,null,null,null,null,null,null,null,null,null,null,null,null,null,null,null,null,null,null,null,null,null,null,null,null,null,null,"Summa",null,null,null,null,null,null,"Vērtības palielinājumi, ieskaitot uzlabojumus",null,null,null,null,null,null,null,null,null,null,null,null,null,null,null,null,null,null,null,null,null,null,null,null,null,null,null,null,null,"Summa"]
[null,3,{"$f":"IFERROR(IF(OR(AS395<>\"\",CD395<>\"\"),\"GS\",\"G\"),\"GS\")","v":"G"},null,null,null,null,null,"R301010302",{"$f":"COLUMN(P395)","v":16},{"$f":"LEFT(IF(O395=\"\",AZ395,O395),LEN(IF(O395=\"\",AZ395,O395))/2)","v":""},null,null,null,null,null,null,null,null,null,null,null,null,null,null,null,null,null,null,null,null,null,null,null,null,null,null,null,null,null,null,null,null,null,null,null,null,null,null,null,null,null,null,null,null,null,null,null,null,null,null,null,null,null,null,null,null,null,null,null,null,null,null,null,null,null,null,null,null,null,null,null,null,null,null,null,"x"]
[null,3,{"$f":"C395","v":"G"},null,null,null,null,-1,"R301010302Summa",{"$f":"\"L:\"&COLUMN(AS396)","v":"L:45"},{"$f":"RIGHT(IF(O395=\"\",AZ395,O395),LEN(IF(O395=\"\",AZ395,O395))/2)","v":""}]
[null,3,{"$f":"C398","v":""}]
[null,3,{"$f":"IF(C399=\"GS\",\"S\",\"\")","v":""},null,null,null,null,null,null,null,null,null,null,null,"Atsavināšana vai likvidācija pārskata gadā",null,null,null,null,null,null,null,null,null,null,null,null,null,null,null,null,null,null,null,null,null,null,null,null,null,null,null,null,null,"Summa",null,null,null,null,null,null,"Atsavināšana vai likvidācija pārskata gadā",null,null,null,null,null,null,null,null,null,null,null,null,null,null,null,null,null,null,null,null,null,null,null,null,null,null,null,null,null,"Summa"]
[null,3,{"$f":"IFERROR(IF(OR(AS399<>\"\",CD399<>\"\"),\"GS\",\"G\"),\"GS\")","v":"G"},null,null,null,null,null,"R301010303",{"$f":"COLUMN(P399)","v":16},{"$f":"LEFT(IF(O399=\"\",AZ399,O399),LEN(IF(O399=\"\",AZ399,O399))/2)","v":""},null,null,null,null,null,null,null,null,null,null,null,null,null,null,null,null,null,null,null,null,null,null,null,null,null,null,null,null,null,null,null,null,null,null,null,null,null,null,null,null,null,null,null,null,null,null,null,null,null,null,null,null,null,null,null,null,null,null,null,null,null,null,null,null,null,null,null,null,null,null,null,null,null,null,null,"x"]
[null,3,{"$f":"C399","v":"G"},null,null,null,null,-1,"R301010303Summa",{"$f":"\"L:\"&COLUMN(AS400)","v":"L:45"},{"$f":"RIGHT(IF(O399=\"\",AZ399,O399),LEN(IF(O399=\"\",AZ399,O399))/2)","v":""}]
[null,3,{"$f":"C402","v":""}]
[null,3,{"$f":"IF(C403=\"GS\",\"S\",\"\")","v":""},null,null,null,null,null,null,null,null,null,null,null,"Pārvietošana uz citu bilances posteni",null,null,null,null,null,null,null,null,null,null,null,null,null,null,null,null,null,null,null,null,null,null,null,null,null,null,null,null,null,"Summa",null,null,null,null,null,null,"Pārvietošana uz citu bilances posteni",null,null,null,null,null,null,null,null,null,null,null,null,null,null,null,null,null,null,null,null,null,null,null,null,null,null,null,null,null,"Summa"]
[null,3,{"$f":"IFERROR(IF(OR(AS403<>\"\",CD403<>\"\"),\"GS\",\"G\"),\"GS\")","v":"G"},null,null,null,null,null,"R301010304",{"$f":"COLUMN(P403)","v":16},{"$f":"LEFT(IF(O403=\"\",AZ403,O403),LEN(IF(O403=\"\",AZ403,O403))/2)","v":""},null,null,null,null,null,null,null,null,null,null,null,null,null,null,null,null,null,null,null,null,null,null,null,null,null,null,null,null,null,null,null,null,null,null,null,null,null,null,null,null,null,null,null,null,null,null,null,null,null,null,null,null,null,null,null,null,null,null,null,null,null,null,null,null,null,null,null,null,null,null,null,null,null,null,null,"x"]
[null,3,{"$f":"C403","v":"G"},null,null,null,null,-1,"R301010304Summa",{"$f":"\"L:\"&COLUMN(AS404)","v":"L:45"},{"$f":"RIGHT(IF(O403=\"\",AZ403,O403),LEN(IF(O403=\"\",AZ403,O403))/2)","v":""}]
[null,3]
[null,3,null,null,null,null,null,null,null,null,null,null,null,null,"Uzkrātās vērtības samazinājuma korekcijas:",null,null,null,null,null,null,null,null,null,null,null,null,null,null,null,null,null,null,null,null,null,null,null,null,null,null,null,null,null,"Summa",null,null,null,null,null,null,"Uzkrātās vērtības samazinājuma korekcijas:",null,null,null,null,null,null,null,null,null,null,null,null,null,null,null,null,null,null,null,null,null,null,null,null,null,null,null,null,null,"Summa"]
[null,3,{"$f":"IFERROR(IF(OR(COUNT(AS407:AU408)>0,COUNT(CD407:CF408)>0),\"GS\",\"G\"),\"GS\")","v":"G"},null,null,null,null,null,"R30101030501",{"$f":"\"L:\"&COLUMN(AS407)","v":"L:45"},null,null,null,null,"pārskata gada sākumā",null,null,null,null,null,null,null,null,null,null,null,null,null,null,null,null,null,null,null,null,null,null,null,null,null,null,null,null,null,null,null,null,null,null,null,null,"pārskata gada sākumā"]
[null,3,{"$f":"C407","v":"G"},null,null,null,null,null,"R30101030502",{"$f":"\"L:\"&COLUMN(AS408)","v":"L:45"},null,null,null,null,"pārskata gada beigās",null,null,null,null,null,null,null,null,null,null,null,null,null,null,null,null,null,null,null,null,null,null,null,null,null,null,null,null,null,null,null,null,null,null,null,null,"pārskata gada beigās"]
[null,3,{"$f":"C410","v":""}]
[null,3,{"$f":"IF(C411=\"GS\",\"S\",\"\")","v":""},null,null,null,null,null,null,null,null,null,null,null,"Pārskata gadā aprēķinātās vērtības samazinājuma korekcijas",null,null,null,null,null,null,null,null,null,null,null,null,null,null,null,null,null,null,null,null,null,null,null,null,null,null,null,null,null,"Summa",null,null,null,null,null,null,"Pārskata gadā aprēķinātās vērtības samazinājuma korekcijas",null,null,null,null,null,null,null,null,null,null,null,null,null,null,null,null,null,null,null,null,null,null,null,null,null,null,null,null,null,"Summa"]
[null,3,{"$f":"IFERROR(IF(OR(AS411<>\"\",CD411<>\"\"),\"GS\",\"G\"),\"GS\")","v":"G"},null,null,null,null,null,"R301010306",{"$f":"COLUMN(P411)","v":16},{"$f":"LEFT(IF(O411=\"\",AZ411,O411),LEN(IF(O411=\"\",AZ411,O411))/2)","v":""},null,null,null,null,null,null,null,null,null,null,null,null,null,null,null,null,null,null,null,null,null,null,null,null,null,null,null,null,null,null,null,null,null,null,null,null,null,null,null,null,null,null,null,null,null,null,null,null,null,null,null,null,null,null,null,null,null,null,null,null,null,null,null,null,null,null,null,null,null,null,null,null,null,null,null,"x"]
[null,3,{"$f":"C411","v":"G"},null,null,null,null,-1,"R301010306Summa",{"$f":"\"L:\"&COLUMN(AS412)","v":"L:45"},{"$f":"RIGHT(IF(O411=\"\",AZ411,O411),LEN(IF(O411=\"\",AZ411,O411))/2)","v":""}]
[null,3,{"$f":"C414","v":""}]
[null,3,{"$f":"IF(C415=\"GS\",\"S\",\"\")","v":""},null,null,null,null,null,null,null,null,null,null,null,"Uzkrāto vērtības samazinājuma korekciju kopsummas izmaiņas saistībā ar objekta atsavināšanu, likvidāciju vai pārvietošanu uz citu posteni",null,null,null,null,null,null,null,null,null,null,null,null,null,null,null,null,null,null,null,null,null,null,null,null,null,null,null,null,null,"Summa",null,null,null,null,null,null,"Uzkrāto vērtības samazinājuma korekciju kopsummas izmaiņas saistībā ar objekta atsavināšanu, likvidāciju vai pārvietošanu uz citu posteni",null,null,null,null,null,null,null,null,null,null,null,null,null,null,null,null,null,null,null,null,null,null,null,null,null,null,null,null,null,"Summa"]
[null,3,{"$f":"IFERROR(IF(OR(AS415<>\"\",CD415<>\"\"),\"GS\",\"G\"),\"GS\")","v":"G"},null,null,null,null,null,"R301010307",{"$f":"COLUMN(P415)","v":16},{"$f":"LEFT(IF(O415=\"\",AZ415,O415),LEN(IF(O415=\"\",AZ415,O415))/2)","v":""},null,null,null,null,null,null,null,null,null,null,null,null,null,null,null,null,null,null,null,null,null,null,null,null,null,null,null,null,null,null,null,null,null,null,null,null,null,null,null,null,null,null,null,null,null,null,null,null,null,null,null,null,null,null,null,null,null,null,null,null,null,null,null,null,null,null,null,null,null,null,null,null,null,null,null,"x"]
[null,3,{"$f":"C415","v":"G"},null,null,null,null,-1,"R301010307Summa",{"$f":"\"L:\"&COLUMN(AS416)","v":"L:45"},{"$f":"RIGHT(IF(O415=\"\",AZ415,O415),LEN(IF(O415=\"\",AZ415,O415))/2)","v":""}]
[null,3]
[null,3,null,null,null,null,null,null,"R301010308",{"$f":"\"L:\"&COLUMN(AS418)","v":"L:45"},null,null,null,null,"Objekta ražošanas pašizmaksā iekļauto aizņēmuma procentu summa",null,null,null,null,null,null,null,null,null,null,null,null,null,null,null,null,null,null,null,null,null,null,null,null,null,null,null,null,null,null,null,null,null,null,null,null,"Objekta ražošanas pašizmaksā iekļauto aizņēmuma procentu summa"]
[null,3]
[null,3,null,null,null,null,null,null,null,null,null,null,null,null,"Bilances vērtība:",null,null,null,null,null,null,null,null,null,null,null,null,null,null,null,null,null,null,null,null,null,null,null,null,null,null,null,null,null,"Summa",null,null,null,null,null,null,"Bilances vērtība:",null,null,null,null,null,null,null,null,null,null,null,null,null,null,null,null,null,null,null,null,null,null,null,null,null,null,null,null,null,"Summa"]
[null,3,{"$f":"IFERROR(IF(OR(COUNT(AS421:AU422)>0,COUNT(CD421:CF422)>0),\"GS\",\"G\"),\"GS\")","v":"G"},null,null,null,null,null,"R30101030801",{"$f":"\"L:\"&COLUMN(AS421)","v":"L:45"},null,null,null,null,"pārskata gada sākumā",null,null,null,null,null,null,null,null,null,null,null,null,null,null,null,null,null,null,null,null,null,null,null,null,null,null,null,null,null,null,null,null,null,null,null,null,"pārskata gada sākumā"]
[null,3,{"$f":"C421","v":"G"},null,null,null,null,null,"R30101030802",{"$f":"\"L:\"&COLUMN(AS422)","v":"L:45"},null,null,null,null,"pārskata gada beigās",null,null,null,null,null,null,null,null,null,null,null,null,null,null,null,null,null,null,null,null,null,null,null,null,null,null,null,null,null,null,null,null,null,null,null,null,"pārskata gada beigās"]
[null,3,{"$f":"C424","v":""}]
[null,3,{"$f":"IF(C425=\"GS\",\"S\",\"\")","v":""},null,null,null,null,null,null,null,null,null,null,null,"Papildus sniegtā informācija, ja tāda ir",null,null,null,null,null,null,null,null,null,null,null,null,null,null,null,null,null,null,null,null,null,null,null,null,null,null,null,null,null,null,null,null,null,null,null,null,"Papildus sniegtā informācija, ja tāda ir"]
[null,3,{"$f":"IFERROR(IF(OR(O425<>\"\",AZ425<>\"\"),\"GS\",\"G\"),\"GS\")","v":"G"},null,null,null,null,null,"R3010104",{"$f":"COLUMN(O425)","v":15},{"$f":"LEFT(IF(O425=\"\",AZ425,O425),LEN(IF(O425=\"\",AZ425,O425))/2)","v":""},null,null,null,null,null,null,null,null,null,null,null,null,null,null,null,null,null,null,null,null,null,null,null,null,null,null,null,null,null,null,null,null,null,null,null,null,null,null,null,null,null,null,null,null,null,null,null,null,null,null,null,null,null,null,null,null,null,null,null,null,null,null,null,null,null,null,null,null,null,null,null,null,null,null,null,"x"]
[null,3,{"$f":"C425","v":"G"},null,null,null,null,null,null,{"$f":"COLUMN(O426)","v":15},{"$f":"RIGHT(IF(O425=\"\",AZ425,O425),LEN(IF(O425=\"\",AZ425,O425))/2)","v":""}]
[null,3,{"$f":"C428","v":""}]
[null,3,{"$f":"C429","v":""},null,null,null,null,null,null,null,null,null,null,null,"Informācija par gadījumiem, kad nemateriālās vērtības vai attīstības izmaksu objekta lietderīgās lietošanas laiku nav iespējams ticami aplēst un objektu paredzēts norakstīt pakāpeniski, to sadalot laikposmā, kas nav ilgāks par 10 gadiem",null,null,null,null,null,null,null,null,null,null,null,null,null,null,null,null,null,null,null,null,null,null,null,null,null,null,null,null,null,null,null,null,null,null,null,null,"Informācija par gadījumiem, kad nemateriālās vērtības vai attīstības izmaksu objekta lietderīgās lietošanas laiku nav iespējams ticami aplēst un objektu paredzēts norakstīt pakāpeniski, to sadalot laikposmā, kas nav ilgāks par 10 gadiem"]
[null,3,{"$f":"IF(C430=\"GS\",\"S\",\"\")","v":""}]
[null,3,{"$f":"IFERROR(IF(OR(O430<>\"\",AZ430<>\"\"),\"GS\",\"G\"),\"GS\")","v":"G"},null,null,null,null,null,"R3010105",{"$f":"COLUMN(O430)","v":15},{"$f":"LEFT(IF(O430=\"\",AZ430,O430),LEN(IF(O430=\"\",AZ430,O430))/2)","v":""},null,null,null,null,null,null,null,null,null,null,null,null,null,null,null,null,null,null,null,null,null,null,null,null,null,null,null,null,null,null,null,null,null,null,null,null,null,null,null,null,null,null,null,null,null,null,null,null,null,null,null,null,null,null,null,null,null,null,null,null,null,null,null,null,null,null,null,null,null,null,null,null,null,null,null,"x"]
[null,3,{"$f":"C430","v":"G"},null,null,null,null,null,null,{"$f":"COLUMN(O431)","v":15},{"$f":"RIGHT(IF(O430=\"\",AZ430,O430),LEN(IF(O430=\"\",AZ430,O430))/2)","v":""}]
[null,3]
[null,3,null,null,null,"x","x",null,null,null,null,null,null,"3.1.2.","pamatlīdzekļi:",null,null,null,null,null,null,null,null,null,null,null,null,null,null,null,null,null,null,null,null,null,null,null,null,null,null,null,null,null,null,null,null,null,null,null,"3.1.2.","pamatlīdzekļi:"]
[null,3,null,null,null,"x","x",null,null,null,null,null,null,"3.1.2.1.","nekustamie īpašumi (informācija par bilances posteni \"Nekustamie īpašumi\")",null,null,null,null,null,null,null,null,null,null,null,null,null,null,null,null,null,null,null,null,null,null,null,null,null,null,null,null,null,null,null,null,null,null,null,"3.1.2.1.","nekustamie īpašumi (informācija par bilances posteni \"Nekustamie īpašumi\")"]
[null,3,null,null,null,null,null,null,null,null,null,null,null,null,"Iegādes izmaksas vai ražošanas pašizmaksa:",null,null,null,null,null,null,null,null,null,null,null,null,null,null,null,null,null,null,null,null,null,null,null,null,null,null,null,null,null,"Summa",null,null,null,null,null,null,"Iegādes izmaksas vai ražošanas pašizmaksa:",null,null,null,null,null,null,null,null,null,null,null,null,null,null,null,null,null,null,null,null,null,null,null,null,null,null,null,null,null,"Summa"]
[null,3,{"$f":"IFERROR(IF(OR(COUNT(AS436:AU437)>0,COUNT(CD436:CF437)>0),\"GS\",\"G\"),\"GS\")","v":"G"},null,null,null,null,null,"R30102010101",{"$f":"\"L:\"&COLUMN(AS436)","v":"L:45"},null,null,null,null,"pārskata gada sākumā",null,null,null,null,null,null,null,null,null,null,null,null,null,null,null,null,null,null,null,null,null,null,null,null,null,null,null,null,null,null,null,null,null,null,null,null,"pārskata gada sākumā"]
[null,3,{"$f":"C436","v":"G"},null,null,null,null,null,"R30102010102",{"$f":"\"L:\"&COLUMN(AS437)","v":"L:45"},null,null,null,null,"pārskata gada beigās",null,null,null,null,null,null,null,null,null,null,null,null,null,null,null,null,null,null,null,null,null,null,null,null,null,null,null,null,null,null,null,null,null,null,null,null,"pārskata gada beigās"]
[null,3,{"$f":"C439","v":""}]
[null,3,{"$f":"IF(C440=\"GS\",\"S\",\"\")","v":""},null,null,null,null,null,null,null,null,null,null,null,"Vērtības palielinājumi, ieskaitot uzlabojumus",null,null,null,null,null,null,null,null,null,null,null,null,null,null,null,null,null,null,null,null,null,null,null,null,null,null,null,null,null,"Summa",null,null,null,null,null,null,"Vērtības palielinājumi, ieskaitot uzlabojumus",null,null,null,null,null,null,null,null,null,null,null,null,null,null,null,null,null,null,null,null,null,null,null,null,null,null,null,null,null,"Summa"]
[null,3,{"$f":"IFERROR(IF(OR(AS440<>\"\",CD440<>\"\"),\"GS\",\"G\"),\"GS\")","v":"G"},null,null,null,null,null,"R301020102",{"$f":"COLUMN(O440)","v":15},{"$f":"LEFT(IF(O440=\"\",AZ440,O440),LEN(IF(O440=\"\",AZ440,O440))/2)","v":""},null,null,null,null,null,null,null,null,null,null,null,null,null,null,null,null,null,null,null,null,null,null,null,null,null,null,null,null,null,null,null,null,null,null,null,null,null,null,null,null,null,null,null,null,null,null,null,null,null,null,null,null,null,null,null,null,null,null,null,null,null,null,null,null,null,null,null,null,null,null,null,null,null,null,null,"x"]
[null,3,{"$f":"C440","v":"G"},null,null,null,null,-1,"R301020102Summa",{"$f":"\"L:\"&COLUMN(AS441)","v":"L:45"},{"$f":"RIGHT(IF(O440=\"\",AZ440,O440),LEN(IF(O440=\"\",AZ440,O440))/2)","v":""}]
[null,3,{"$f":"C443","v":""}]
[null,3,{"$f":"IF(C444=\"GS\",\"S\",\"\")","v":""},null,null,null,null,null,null,null,null,null,null,null,"Atsavināšana vai likvidācija pārskata gadā",null,null,null,null,null,null,null,null,null,null,null,null,null,null,null,null,null,null,null,null,null,null,null,null,null,null,null,null,null,"Summa",null,null,null,null,null,null,"Atsavināšana vai likvidācija pārskata gadā",null,null,null,null,null,null,null,null,null,null,null,null,null,null,null,null,null,null,null,null,null,null,null,null,null,null,null,null,null,"Summa"]
[null,3,{"$f":"IFERROR(IF(OR(AS444<>\"\",CD444<>\"\"),\"GS\",\"G\"),\"GS\")","v":"G"},null,null,null,null,null,"R301020103",{"$f":"COLUMN(O444)","v":15},{"$f":"LEFT(IF(O444=\"\",AZ444,O444),LEN(IF(O444=\"\",AZ444,O444))/2)","v":""},null,null,null,null,null,null,null,null,null,null,null,null,null,null,null,null,null,null,null,null,null,null,null,null,null,null,null,null,null,null,null,null,null,null,null,null,null,null,null,null,null,null,null,null,null,null,null,null,null,null,null,null,null,null,null,null,null,null,null,null,null,null,null,null,null,null,null,null,null,null,null,null,null,null,null,"x"]
[null,3,{"$f":"C444","v":"G"},null,null,null,null,-1,"R301020103Summa",{"$f":"\"L:\"&COLUMN(AS445)","v":"L:45"},{"$f":"RIGHT(IF(O444=\"\",AZ444,O444),LEN(IF(O444=\"\",AZ444,O444))/2)","v":""}]
[null,3,{"$f":"C447","v":""}]
[null,3,{"$f":"IF(C448=\"GS\",\"S\",\"\")","v":""},null,null,null,null,null,null,null,null,null,null,null,"Pārvietošana uz citu bilances posteni",null,null,null,null,null,null,null,null,null,null,null,null,null,null,null,null,null,null,null,null,null,null,null,null,null,null,null,null,null,"Summa",null,null,null,null,null,null,"Pārvietošana uz citu bilances posteni",null,null,null,null,null,null,null,null,null,null,null,null,null,null,null,null,null,null,null,null,null,null,null,null,null,null,null,null,null,"Summa"]
[null,3,{"$f":"IFERROR(IF(OR(AS448<>\"\",CD448<>\"\"),\"GS\",\"G\"),\"GS\")","v":"G"},null,null,null,null,null,"R301020104",{"$f":"COLUMN(O448)","v":15},{"$f":"LEFT(IF(O448=\"\",AZ448,O448),LEN(IF(O448=\"\",AZ448,O448))/2)","v":""},null,null,null,null,null,null,null,null,null,null,null,null,null,null,null,null,null,null,null,null,null,null,null,null,null,null,null,null,null,null,null,null,null,null,null,null,null,null,null,null,null,null,null,null,null,null,null,null,null,null,null,null,null,null,null,null,null,null,null,null,null,null,null,null,null,null,null,null,null,null,null,null,null,null,null,"x"]
[null,3,{"$f":"C448","v":"G"},null,null,null,null,-1,"R301020104Summa",{"$f":"\"L:\"&COLUMN(AS449)","v":"L:45"},{"$f":"RIGHT(IF(O448=\"\",AZ448,O448),LEN(IF(O448=\"\",AZ448,O448))/2)","v":""}]
[null,3]
[null,3,null,null,null,null,null,null,null,null,null,null,null,null,"Uzkrātās vērtības samazinājuma korekcijas:",null,null,null,null,null,null,null,null,null,null,null,null,null,null,null,null,null,null,null,null,null,null,null,null,null,null,null,null,null,"Summa",null,null,null,null,null,null,"Uzkrātās vērtības samazinājuma korekcijas:",null,null,null,null,null,null,null,null,null,null,null,null,null,null,null,null,null,null,null,null,null,null,null,null,null,null,null,null,null,"Summa"]
[null,3,{"$f":"IFERROR(IF(OR(COUNT(AS452:AU453)>0,COUNT(CD452:CF453)>0),\"GS\",\"G\"),\"GS\")","v":"G"},null,null,null,null,null,"R30102010501",{"$f":"\"L:\"&COLUMN(AS452)","v":"L:45"},null,null,null,null,"pārskata gada sākumā",null,null,null,null,null,null,null,null,null,null,null,null,null,null,null,null,null,null,null,null,null,null,null,null,null,null,null,null,null,null,null,null,null,null,null,null,"pārskata gada sākumā"]
[null,3,{"$f":"C452","v":"G"},null,null,null,null,null,"R30102010502",{"$f":"\"L:\"&COLUMN(AS453)","v":"L:45"},null,null,null,null,"pārskata gada beigās",null,null,null,null,null,null,null,null,null,null,null,null,null,null,null,null,null,null,null,null,null,null,null,null,null,null,null,null,null,null,null,null,null,null,null,null,"pārskata gada beigās"]
[null,3,{"$f":"C455","v":""}]
[null,3,{"$f":"IF(C456=\"GS\",\"S\",\"\")","v":""},null,null,null,null,null,null,null,null,null,null,null,"Pārskata gadā aprēķinātās vērtības samazinājuma korekcijas",null,null,null,null,null,null,null,null,null,null,null,null,null,null,null,null,null,null,null,null,null,null,null,null,null,null,null,null,null,"Summa",null,null,null,null,null,null,"Pārskata gadā aprēķinātās vērtības samazinājuma korekcijas",null,null,null,null,null,null,null,null,null,null,null,null,null,null,null,null,null,null,null,null,null,null,null,null,null,null,null,null,null,"Summa"]
[null,3,{"$f":"IFERROR(IF(OR(AS456<>\"\",CD456<>\"\"),\"GS\",\"G\"),\"GS\")","v":"G"},null,null,null,null,null,"R301020106",{"$f":"COLUMN(O456)","v":15},{"$f":"LEFT(IF(O456=\"\",AZ456,O456),LEN(IF(O456=\"\",AZ456,O456))/2)","v":""},null,null,null,null,null,null,null,null,null,null,null,null,null,null,null,null,null,null,null,null,null,null,null,null,null,null,null,null,null,null,null,null,null,null,null,null,null,null,null,null,null,null,null,null,null,null,null,null,null,null,null,null,null,null,null,null,null,null,null,null,null,null,null,null,null,null,null,null,null,null,null,null,null,null,null,"x"]
[null,3,{"$f":"C456","v":"G"},null,null,null,null,-1,"R301020106Summa",{"$f":"\"L:\"&COLUMN(AS457)","v":"L:45"},{"$f":"RIGHT(IF(O456=\"\",AZ456,O456),LEN(IF(O456=\"\",AZ456,O456))/2)","v":""}]
[null,3,{"$f":"C459","v":""}]
[null,3,{"$f":"IF(C460=\"GS\",\"S\",\"\")","v":""},null,null,null,null,null,null,null,null,null,null,null,"Uzkrāto vērtības samazinājuma korekciju kopsummas izmaiņas saistībā ar objekta atsavināšanu, likvidāciju vai pārvietošanu uz citu posteni",null,null,null,null,null,null,null,null,null,null,null,null,null,null,null,null,null,null,null,null,null,null,null,null,null,null,null,null,null,"Summa",null,null,null,null,null,null,"Uzkrāto vērtības samazinājuma korekciju kopsummas izmaiņas saistībā ar objekta atsavināšanu, likvidāciju vai pārvietošanu uz citu posteni",null,null,null,null,null,null,null,null,null,null,null,null,null,null,null,null,null,null,null,null,null,null,null,null,null,null,null,null,null,"Summa"]
[null,3,{"$f":"IFERROR(IF(OR(AS460<>\"\",CD460<>\"\"),\"GS\",\"G\"),\"GS\")","v":"G"},null,null,null,null,null,"R301020107",{"$f":"COLUMN(O460)","v":15},{"$f":"LEFT(IF(O460=\"\",AZ460,O460),LEN(IF(O460=\"\",AZ460,O460))/2)","v":""},null,null,null,null,null,null,null,null,null,null,null,null,null,null,null,null,null,null,null,null,null,null,null,null,null,null,null,null,null,null,null,null,null,null,null,null,null,null,null,null,null,null,null,null,null,null,null,null,null,null,null,null,null,null,null,null,null,null,null,null,null,null,null,null,null,null,null,null,null,null,null,null,null,null,null,"x"]
[null,3,{"$f":"C460","v":"G"},null,null,null,null,-1,"R301020107Summa",{"$f":"\"L:\"&COLUMN(AS461)","v":"L:45"},{"$f":"RIGHT(IF(O460=\"\",AZ460,O460),LEN(IF(O460=\"\",AZ460,O460))/2)","v":""}]
[null,3]
[null,3,null,null,null,null,null,null,"R301020108",{"$f":"\"L:\"&COLUMN(AS463)","v":"L:45"},null,null,null,null,"Objekta ražošanas pašizmaksā iekļauto aizņēmuma procentu summa",null,null,null,null,null,null,null,null,null,null,null,null,null,null,null,null,null,null,null,null,null,null,null,null,null,null,null,null,null,null,null,null,null,null,null,null,"Objekta ražošanas pašizmaksā iekļauto aizņēmuma procentu summa"]
[null,3]
[null,3,null,null,null,null,null,null,null,null,null,null,null,null,"Bilances vērtība:",null,null,null,null,null,null,null,null,null,null,null,null,null,null,null,null,null,null,null,null,null,null,null,null,null,null,null,null,null,"Summa",null,null,null,null,null,null,"Bilances vērtība:",null,null,null,null,null,null,null,null,null,null,null,null,null,null,null,null,null,null,null,null,null,null,null,null,null,null,null,null,null,"Summa"]
[null,3,{"$f":"IFERROR(IF(OR(COUNT(AS466:AU467)>0,COUNT(CD466:CF467)>0),\"GS\",\"G\"),\"GS\")","v":"G"},null,null,null,null,null,"R30102010801",{"$f":"\"L:\"&COLUMN(AS466)","v":"L:45"},null,null,null,null,"pārskata gada sākumā",null,null,null,null,null,null,null,null,null,null,null,null,null,null,null,null,null,null,null,null,null,null,null,null,null,null,null,null,null,null,null,null,null,null,null,null,"pārskata gada sākumā"]
[null,3,{"$f":"C466","v":"G"},null,null,null,null,null,"R30102010802",{"$f":"\"L:\"&COLUMN(AS467)","v":"L:45"},null,null,null,null,"pārskata gada beigās",null,null,null,null,null,null,null,null,null,null,null,null,null,null,null,null,null,null,null,null,null,null,null,null,null,null,null,null,null,null,null,null,null,null,null,null,"pārskata gada beigās"]
[null,3]
[null,3,null,null,null,"x","x",null,null,null,null,null,null,"3.1.2.2.","dzīvnieki un augi (informācija par bilances posteni \"Dzīvnieki un augi\")",null,null,null,null,null,null,null,null,null,null,null,null,null,null,null,null,null,null,null,null,null,null,null,null,null,null,null,null,null,null,null,null,null,null,null,"3.1.2.2.","dzīvnieki un augi (informācija par bilances posteni \"Dzīvnieki un augi\")"]
[null,3,null,null,null,null,null,null,null,null,null,null,null,null,"Iegādes izmaksas vai ražošanas pašizmaksa:",null,null,null,null,null,null,null,null,null,null,null,null,null,null,null,null,null,null,null,null,null,null,null,null,null,null,null,null,null,"Summa",null,null,null,null,null,null,"Iegādes izmaksas vai ražošanas pašizmaksa:",null,null,null,null,null,null,null,null,null,null,null,null,null,null,null,null,null,null,null,null,null,null,null,null,null,null,null,null,null,"Summa"]
[null,3,{"$f":"IFERROR(IF(OR(COUNT(AS471:AU472)>0,COUNT(CD471:CF472)>0),\"GS\",\"G\"),\"GS\")","v":"G"},null,null,null,null,null,"R30102020101",{"$f":"\"L:\"&COLUMN(AS471)","v":"L:45"},null,null,null,null,"pārskata gada sākumā",null,null,null,null,null,null,null,null,null,null,null,null,null,null,null,null,null,null,null,null,null,null,null,null,null,null,null,null,null,null,null,null,null,null,null,null,"pārskata gada sākumā"]
[null,3,{"$f":"C471","v":"G"},null,null,null,null,null,"R30102020102",{"$f":"\"L:\"&COLUMN(AS472)","v":"L:45"},null,null,null,null,"pārskata gada beigās",null,null,null,null,null,null,null,null,null,null,null,null,null,null,null,null,null,null,null,null,null,null,null,null,null,null,null,null,null,null,null,null,null,null,null,null,"pārskata gada beigās"]
[null,3,{"$f":"C474","v":""}]
[null,3,{"$f":"IF(C475=\"GS\",\"S\",\"\")","v":""},null,null,null,null,null,null,null,null,null,null,null,"Vērtības palielinājumi, ieskaitot uzlabojumus",null,null,null,null,null,null,null,null,null,null,null,null,null,null,null,null,null,null,null,null,null,null,null,null,null,null,null,null,null,"Summa",null,null,null,null,null,null,"Vērtības palielinājumi, ieskaitot uzlabojumus",null,null,null,null,null,null,null,null,null,null,null,null,null,null,null,null,null,null,null,null,null,null,null,null,null,null,null,null,null,"Summa"]
[null,3,{"$f":"IFERROR(IF(OR(AS475<>\"\",CD475<>\"\"),\"GS\",\"G\"),\"GS\")","v":"G"},null,null,null,null,null,"R301020202",{"$f":"COLUMN(O475)","v":15},{"$f":"LEFT(IF(O475=\"\",AZ475,O475),LEN(IF(O475=\"\",AZ475,O475))/2)","v":""},null,null,null,null,null,null,null,null,null,null,null,null,null,null,null,null,null,null,null,null,null,null,null,null,null,null,null,null,null,null,null,null,null,null,null,null,null,null,null,null,null,null,null,null,null,null,null,null,null,null,null,null,null,null,null,null,null,null,null,null,null,null,null,null,null,null,null,null,null,null,null,null,null,null,null,"x"]
[null,3,{"$f":"C475","v":"G"},null,null,null,null,-1,"R301020202Summa",{"$f":"\"L:\"&COLUMN(AS476)","v":"L:45"},{"$f":"RIGHT(IF(O475=\"\",AZ475,O475),LEN(IF(O475=\"\",AZ475,O475))/2)","v":""}]
[null,3,{"$f":"C478","v":""}]
[null,3,{"$f":"IF(C479=\"GS\",\"S\",\"\")","v":""},null,null,null,null,null,null,null,null,null,null,null,"Atsavināšana vai likvidācija pārskata gadā",null,null,null,null,null,null,null,null,null,null,null,null,null,null,null,null,null,null,null,null,null,null,null,null,null,null,null,null,null,"Summa",null,null,null,null,null,null,"Atsavināšana vai likvidācija pārskata gadā",null,null,null,null,null,null,null,null,null,null,null,null,null,null,null,null,null,null,null,null,null,null,null,null,null,null,null,null,null,"Summa"]
[null,3,{"$f":"IFERROR(IF(OR(AS479<>\"\",CD479<>\"\"),\"GS\",\"G\"),\"GS\")","v":"G"},null,null,null,null,null,"R301020203",{"$f":"COLUMN(O479)","v":15},{"$f":"LEFT(IF(O479=\"\",AZ479,O479),LEN(IF(O479=\"\",AZ479,O479))/2)","v":""},null,null,null,null,null,null,null,null,null,null,null,null,null,null,null,null,null,null,null,null,null,null,null,null,null,null,null,null,null,null,null,null,null,null,null,null,null,null,null,null,null,null,null,null,null,null,null,null,null,null,null,null,null,null,null,null,null,null,null,null,null,null,null,null,null,null,null,null,null,null,null,null,null,null,null,"x"]
[null,3,{"$f":"C479","v":"G"},null,null,null,null,-1,"R301020203Summa",{"$f":"\"L:\"&COLUMN(AS480)","v":"L:45"},{"$f":"RIGHT(IF(O479=\"\",AZ479,O479),LEN(IF(O479=\"\",AZ479,O479))/2)","v":""}]
[null,3,{"$f":"C482","v":""}]
[null,3,{"$f":"IF(C483=\"GS\",\"S\",\"\")","v":""},null,null,null,null,null,null,null,null,null,null,null,"Pārvietošana uz citu bilances posteni",null,null,null,null,null,null,null,null,null,null,null,null,null,null,null,null,null,null,null,null,null,null,null,null,null,null,null,null,null,"Summa",null,null,null,null,null,null,"Pārvietošana uz citu bilances posteni",null,null,null,null,null,null,null,null,null,null,null,null,null,null,null,null,null,null,null,null,null,null,null,null,null,null,null,null,null,"Summa"]
[null,3,{"$f":"IFERROR(IF(OR(AS483<>\"\",CD483<>\"\"),\"GS\",\"G\"),\"GS\")","v":"G"},null,null,null,null,null,"R301020204",{"$f":"COLUMN(O483)","v":15},{"$f":"LEFT(IF(O483=\"\",AZ483,O483),LEN(IF(O483=\"\",AZ483,O483))/2)","v":""},null,null,null,null,null,null,null,null,null,null,null,null,null,null,null,null,null,null,null,null,null,null,null,null,null,null,null,null,null,null,null,null,null,null,null,null,null,null,null,null,null,null,null,null,null,null,null,null,null,null,null,null,null,null,null,null,null,null,null,null,null,null,null,null,null,null,null,null,null,null,null,null,null,null,null,"x"]
[null,3,{"$f":"C483","v":"G"},null,null,null,null,-1,"R301020204Summa",{"$f":"\"L:\"&COLUMN(AS484)","v":"L:45"},{"$f":"RIGHT(IF(O483=\"\",AZ483,O483),LEN(IF(O483=\"\",AZ483,O483))/2)","v":""}]
[null,3]
[null,3,null,null,null,null,null,null,null,null,null,null,null,null,"Uzkrātās vērtības samazinājuma korekcijas:",null,null,null,null,null,null,null,null,null,null,null,null,null,null,null,null,null,null,null,null,null,null,null,null,null,null,null,null,null,"Summa",null,null,null,null,null,null,"Uzkrātās vērtības samazinājuma korekcijas:",null,null,null,null,null,null,null,null,null,null,null,null,null,null,null,null,null,null,null,null,null,null,null,null,null,null,null,null,null,"Summa"]
[null,3,{"$f":"IFERROR(IF(OR(COUNT(AS487:AU488)>0,COUNT(CD487:CF488)>0),\"GS\",\"G\"),\"GS\")","v":"G"},null,null,null,null,null,"R30102020501",{"$f":"\"L:\"&COLUMN(AS487)","v":"L:45"},null,null,null,null,"pārskata gada sākumā",null,null,null,null,null,null,null,null,null,null,null,null,null,null,null,null,null,null,null,null,null,null,null,null,null,null,null,null,null,null,null,null,null,null,null,null,"pārskata gada sākumā"]
[null,3,{"$f":"C487","v":"G"},null,null,null,null,null,"R30102020502",{"$f":"\"L:\"&COLUMN(AS488)","v":"L:45"},null,null,null,null,"pārskata gada beigās",null,null,null,null,null,null,null,null,null,null,null,null,null,null,null,null,null,null,null,null,null,null,null,null,null,null,null,null,null,null,null,null,null,null,null,null,"pārskata gada beigās"]
[null,3,{"$f":"C490","v":""}]
[null,3,{"$f":"IF(C491=\"GS\",\"S\",\"\")","v":""},null,null,null,null,null,null,null,null,null,null,null,"Pārskata gadā aprēķinātās vērtības samazinājuma korekcijas",null,null,null,null,null,null,null,null,null,null,null,null,null,null,null,null,null,null,null,null,null,null,null,null,null,null,null,null,null,"Summa",null,null,null,null,null,null,"Pārskata gadā aprēķinātās vērtības samazinājuma korekcijas",null,null,null,null,null,null,null,null,null,null,null,null,null,null,null,null,null,null,null,null,null,null,null,null,null,null,null,null,null,"Summa"]
[null,3,{"$f":"IFERROR(IF(OR(AS491<>\"\",CD491<>\"\"),\"GS\",\"G\"),\"GS\")","v":"G"},null,null,null,null,null,"R301020206",{"$f":"COLUMN(O491)","v":15},{"$f":"LEFT(IF(O491=\"\",AZ491,O491),LEN(IF(O491=\"\",AZ491,O491))/2)","v":""}]
[null,3,{"$f":"C491","v":"G"},null,null,null,null,-1,"R301020206Summa",{"$f":"\"L:\"&COLUMN(AS492)","v":"L:45"},{"$f":"RIGHT(IF(O491=\"\",AZ491,O491),LEN(IF(O491=\"\",AZ491,O491))/2)","v":""}]
[null,3,{"$f":"C494","v":""}]
[null,3,{"$f":"IF(C495=\"GS\",\"S\",\"\")","v":""},null,null,null,null,null,null,null,null,null,null,null,"Uzkrāto vērtības samazinājuma korekciju kopsummas izmaiņas saistībā ar objekta atsavināšanu, likvidāciju vai pārvietošanu uz citu posteni",null,null,null,null,null,null,null,null,null,null,null,null,null,null,null,null,null,null,null,null,null,null,null,null,null,null,null,null,null,"Summa",null,null,null,null,null,null,"Uzkrāto vērtības samazinājuma korekciju kopsummas izmaiņas saistībā ar objekta atsavināšanu, likvidāciju vai pārvietošanu uz citu posteni",null,null,null,null,null,null,null,null,null,null,null,null,null,null,null,null,null,null,null,null,null,null,null,null,null,null,null,null,null,"Summa"]
[null,3,{"$f":"IFERROR(IF(OR(AS495<>\"\",CD495<>\"\"),\"GS\",\"G\"),\"GS\")","v":"G"},null,null,null,null,null,"R301020207",{"$f":"COLUMN(O495)","v":15},{"$f":"LEFT(IF(O495=\"\",AZ495,O495),LEN(IF(O495=\"\",AZ495,O495))/2)","v":""},null,null,null,null,null,null,null,null,null,null,null,null,null,null,null,null,null,null,null,null,null,null,null,null,null,null,null,null,null,null,null,null,null,null,null,null,null,null,null,null,null,null,null,null,null,null,null,null,null,null,null,null,null,null,null,null,null,null,null,null,null,null,null,null,null,null,null,null,null,null,null,null,null,null,null,"x"]
[null,3,{"$f":"C495","v":"G"},null,null,null,null,-1,"R301020207Summa",{"$f":"\"L:\"&COLUMN(AS496)","v":"L:45"},{"$f":"RIGHT(IF(O495=\"\",AZ495,O495),LEN(IF(O495=\"\",AZ495,O495))/2)","v":""}]
[null,3]
[null,3,null,null,null,null,null,null,"R301020208",{"$f":"\"L:\"&COLUMN(AS498)","v":"L:45"},null,null,null,null,"Objekta ražošanas pašizmaksā iekļauto aizņēmuma procentu summa",null,null,null,null,null,null,null,null,null,null,null,null,null,null,null,null,null,null,null,null,null,null,null,null,null,null,null,null,null,null,null,null,null,null,null,null,"Objekta ražošanas pašizmaksā iekļauto aizņēmuma procentu summa"]
[null,3]
[null,3,null,null,null,null,null,null,null,null,null,null,null,null,"Bilances vērtība:",null,null,null,null,null,null,null,null,null,null,null,null,null,null,null,null,null,null,null,null,null,null,null,null,null,null,null,null,null,"Summa",null,null,null,null,null,null,"Bilances vērtība:",null,null,null,null,null,null,null,null,null,null,null,null,null,null,null,null,null,null,null,null,null,null,null,null,null,null,null,null,null,"Summa"]
[null,3,{"$f":"IFERROR(IF(OR(COUNT(AS501:AU502)>0,COUNT(CD501:CF502)>0),\"GS\",\"G\"),\"GS\")","v":"G"},null,null,null,null,null,"R30102020801",{"$f":"\"L:\"&COLUMN(AS501)","v":"L:45"},null,null,null,null,"pārskata gada sākumā",null,null,null,null,null,null,null,null,null,null,null,null,null,null,null,null,null,null,null,null,null,null,null,null,null,null,null,null,null,null,null,null,null,null,null,null,"pārskata gada sākumā"]
[null,3,{"$f":"C501","v":"G"},null,null,null,null,null,"R30102020802",{"$f":"\"L:\"&COLUMN(AS502)","v":"L:45"},null,null,null,null,"pārskata gada beigās",null,null,null,null,null,null,null,null,null,null,null,null,null,null,null,null,null,null,null,null,null,null,null,null,null,null,null,null,null,null,null,null,null,null,null,null,"pārskata gada beigās"]
[null,3]
[null,3,null,null,null,"x","x",null,null,null,null,null,null,"3.1.2.3.","tehnoloģiskās iekārtas un ierīces (informācija par bilances posteni \"Tehnoloģiskās iekārtas un ierīces\")",null,null,null,null,null,null,null,null,null,null,null,null,null,null,null,null,null,null,null,null,null,null,null,null,null,null,null,null,null,null,null,null,null,null,null,"3.1.2.3.","tehnoloģiskās iekārtas un ierīces (informācija par bilances posteni \"Tehnoloģiskās iekārtas un ierīces\")"]
[null,3,null,null,null,null,null,null,null,null,null,null,null,null,"Iegādes izmaksas vai ražošanas pašizmaksa:",null,null,null,null,null,null,null,null,null,null,null,null,null,null,null,null,null,null,null,null,null,null,null,null,null,null,null,null,null,"Summa",null,null,null,null,null,null,"Iegādes izmaksas vai ražošanas pašizmaksa:",null,null,null,null,null,null,null,null,null,null,null,null,null,null,null,null,null,null,null,null,null,null,null,null,null,null,null,null,null,"Summa"]
[null,3,{"$f":"IFERROR(IF(OR(COUNT(AS506:AU507)>0,COUNT(CD506:CF507)>0),\"GS\",\"G\"),\"GS\")","v":"G"},null,null,null,null,null,"R30102030101",{"$f":"\"L:\"&COLUMN(AS506)","v":"L:45"},null,null,null,null,"pārskata gada sākumā",null,null,null,null,null,null,null,null,null,null,null,null,null,null,null,null,null,null,null,null,null,null,null,null,null,null,null,null,null,null,null,null,null,null,null,null,"pārskata gada sākumā"]
[null,3,{"$f":"C506","v":"G"},null,null,null,null,null,"R30102030102",{"$f":"\"L:\"&COLUMN(AS507)","v":"L:45"},null,null,null,null,"pārskata gada beigās",null,null,null,null,null,null,null,null,null,null,null,null,null,null,null,null,null,null,null,null,null,null,null,null,null,null,null,null,null,null,null,null,null,null,null,null,"pārskata gada beigās"]
[null,3,{"$f":"C509","v":""}]
[null,3,{"$f":"IF(C510=\"GS\",\"S\",\"\")","v":""},null,null,null,null,null,null,null,null,null,null,null,"Vērtības palielinājumi, ieskaitot uzlabojumus",null,null,null,null,null,null,null,null,null,null,null,null,null,null,null,null,null,null,null,null,null,null,null,null,null,null,null,null,null,"Summa",null,null,null,null,null,null,"Vērtības palielinājumi, ieskaitot uzlabojumus",null,null,null,null,null,null,null,null,null,null,null,null,null,null,null,null,null,null,null,null,null,null,null,null,null,null,null,null,null,"Summa"]
[null,3,{"$f":"IFERROR(IF(OR(AS510<>\"\",CD510<>\"\"),\"GS\",\"G\"),\"GS\")","v":"G"},null,null,null,null,null,"R301020302",{"$f":"COLUMN(O510)","v":15},{"$f":"LEFT(IF(O510=\"\",AZ510,O510),LEN(IF(O510=\"\",AZ510,O510))/2)","v":""},null,null,null,null,null,null,null,null,null,null,null,null,null,null,null,null,null,null,null,null,null,null,null,null,null,null,null,null,null,null,null,null,null,null,null,null,null,null,null,null,null,null,null,null,null,null,null,null,null,null,null,null,null,null,null,null,null,null,null,null,null,null,null,null,null,null,null,null,null,null,null,null,null,null,null,"x"]
[null,3,{"$f":"C510","v":"G"},null,null,null,null,-1,"R301020302Summa",{"$f":"\"L:\"&COLUMN(AS511)","v":"L:45"},{"$f":"RIGHT(IF(O510=\"\",AZ510,O510),LEN(IF(O510=\"\",AZ510,O510))/2)","v":""}]
[null,3,{"$f":"C513","v":""}]
[null,3,{"$f":"IF(C514=\"GS\",\"S\",\"\")","v":""},null,null,null,null,null,null,null,null,null,null,null,"Atsavināšana vai likvidācija pārskata gadā",null,null,null,null,null,null,null,null,null,null,null,null,null,null,null,null,null,null,null,null,null,null,null,null,null,null,null,null,null,"Summa",null,null,null,null,null,null,"Atsavināšana vai likvidācija pārskata gadā",null,null,null,null,null,null,null,null,null,null,null,null,null,null,null,null,null,null,null,null,null,null,null,null,null,null,null,null,null,"Summa"]
[null,3,{"$f":"IFERROR(IF(OR(AS514<>\"\",CD514<>\"\"),\"GS\",\"G\"),\"GS\")","v":"G"},null,null,null,null,null,"R301020303",{"$f":"COLUMN(O514)","v":15},{"$f":"LEFT(IF(O514=\"\",AZ514,O514),LEN(IF(O514=\"\",AZ514,O514))/2)","v":""},null,null,null,null,null,null,null,null,null,null,null,null,null,null,null,null,null,null,null,null,null,null,null,null,null,null,null,null,null,null,null,null,null,null,null,null,null,null,null,null,null,null,null,null,null,null,null,null,null,null,null,null,null,null,null,null,null,null,null,null,null,null,null,null,null,null,null,null,null,null,null,null,null,null,null,"x"]
[null,3,{"$f":"C514","v":"G"},null,null,null,null,-1,"R301020303Summa",{"$f":"\"L:\"&COLUMN(AS515)","v":"L:45"},{"$f":"RIGHT(IF(O514=\"\",AZ514,O514),LEN(IF(O514=\"\",AZ514,O514))/2)","v":""}]
[null,3,{"$f":"C517","v":""}]
[null,3,{"$f":"IF(C518=\"GS\",\"S\",\"\")","v":""},null,null,null,null,null,null,null,null,null,null,null,"Pārvietošana uz citu bilances posteni",null,null,null,null,null,null,null,null,null,null,null,null,null,null,null,null,null,null,null,null,null,null,null,null,null,null,null,null,null,"Summa",null,null,null,null,null,null,"Pārvietošana uz citu bilances posteni",null,null,null,null,null,null,null,null,null,null,null,null,null,null,null,null,null,null,null,null,null,null,null,null,null,null,null,null,null,"Summa"]
[null,3,{"$f":"IFERROR(IF(OR(AS518<>\"\",CD518<>\"\"),\"GS\",\"G\"),\"GS\")","v":"G"},null,null,null,null,null,"R301020304",{"$f":"COLUMN(O518)","v":15},{"$f":"LEFT(IF(O518=\"\",AZ518,O518),LEN(IF(O518=\"\",AZ518,O518))/2)","v":""},null,null,null,null,null,null,null,null,null,null,null,null,null,null,null,null,null,null,null,null,null,null,null,null,null,null,null,null,null,null,null,null,null,null,null,null,null,null,null,null,null,null,null,null,null,null,null,null,null,null,null,null,null,null,null,null,null,null,null,null,null,null,null,null,null,null,null,null,null,null,null,null,null,null,null,"x"]
[null,3,{"$f":"C518","v":"G"},null,null,null,null,-1,"R301020304Summa",{"$f":"\"L:\"&COLUMN(AS519)","v":"L:45"},{"$f":"RIGHT(IF(O518=\"\",AZ518,O518),LEN(IF(O518=\"\",AZ518,O518))/2)","v":""}]
[null,3]
[null,3,null,null,null,null,null,null,null,null,null,null,null,null,"Uzkrātās vērtības samazinājuma korekcijas:",null,null,null,null,null,null,null,null,null,null,null,null,null,null,null,null,null,null,null,null,null,null,null,null,null,null,null,null,null,"Summa",null,null,null,null,null,null,"Uzkrātās vērtības samazinājuma korekcijas:",null,null,null,null,null,null,null,null,null,null,null,null,null,null,null,null,null,null,null,null,null,null,null,null,null,null,null,null,null,"Summa"]
[null,3,{"$f":"IFERROR(IF(OR(COUNT(AS522:AU523)>0,COUNT(CD522:CF523)>0),\"GS\",\"G\"),\"GS\")","v":"G"},null,null,null,null,null,"R30102030501",{"$f":"\"L:\"&COLUMN(AS522)","v":"L:45"},null,null,null,null,"pārskata gada sākumā",null,null,null,null,null,null,null,null,null,null,null,null,null,null,null,null,null,null,null,null,null,null,null,null,null,null,null,null,null,null,null,null,null,null,null,null,"pārskata gada sākumā"]
[null,3,{"$f":"C522","v":"G"},null,null,null,null,null,"R30102030502",{"$f":"\"L:\"&COLUMN(AS523)","v":"L:45"},null,null,null,null,"pārskata gada beigās",null,null,null,null,null,null,null,null,null,null,null,null,null,null,null,null,null,null,null,null,null,null,null,null,null,null,null,null,null,null,null,null,null,null,null,null,"pārskata gada beigās"]
[null,3,{"$f":"C525","v":""}]
[null,3,{"$f":"IF(C526=\"GS\",\"S\",\"\")","v":""},null,null,null,null,null,null,null,null,null,null,null,"Pārskata gadā aprēķinātās vērtības samazinājuma korekcijas",null,null,null,null,null,null,null,null,null,null,null,null,null,null,null,null,null,null,null,null,null,null,null,null,null,null,null,null,null,"Summa",null,null,null,null,null,null,"Pārskata gadā aprēķinātās vērtības samazinājuma korekcijas",null,null,null,null,null,null,null,null,null,null,null,null,null,null,null,null,null,null,null,null,null,null,null,null,null,null,null,null,null,"Summa"]
[null,3,{"$f":"IFERROR(IF(OR(AS526<>\"\",CD526<>\"\"),\"GS\",\"G\"),\"GS\")","v":"G"},null,null,null,null,null,"R301020306",{"$f":"COLUMN(O526)","v":15},{"$f":"LEFT(IF(O526=\"\",AZ526,O526),LEN(IF(O526=\"\",AZ526,O526))/2)","v":""},null,null,null,null,null,null,null,null,null,null,null,null,null,null,null,null,null,null,null,null,null,null,null,null,null,null,null,null,null,null,null,null,null,null,null,null,null,null,null,null,null,null,null,null,null,null,null,null,null,null,null,null,null,null,null,null,null,null,null,null,null,null,null,null,null,null,null,null,null,null,null,null,null,null,null,"x"]
[null,3,{"$f":"C526","v":"G"},null,null,null,null,-1,"R301020306Summa",{"$f":"\"L:\"&COLUMN(AS527)","v":"L:45"},{"$f":"RIGHT(IF(O526=\"\",AZ526,O526),LEN(IF(O526=\"\",AZ526,O526))/2)","v":""}]
[null,3,{"$f":"C529","v":""}]
[null,3,{"$f":"IF(C530=\"GS\",\"S\",\"\")","v":""},null,null,null,null,null,null,null,null,null,null,null,"Uzkrāto vērtības samazinājuma korekciju kopsummas izmaiņas saistībā ar objekta atsavināšanu, likvidāciju vai pārvietošanu uz citu posteni",null,null,null,null,null,null,null,null,null,null,null,null,null,null,null,null,null,null,null,null,null,null,null,null,null,null,null,null,null,"Summa",null,null,null,null,null,null,"Uzkrāto vērtības samazinājuma korekciju kopsummas izmaiņas saistībā ar objekta atsavināšanu, likvidāciju vai pārvietošanu uz citu posteni",null,null,null,null,null,null,null,null,null,null,null,null,null,null,null,null,null,null,null,null,null,null,null,null,null,null,null,null,null,"Summa"]
[null,3,{"$f":"IFERROR(IF(OR(AS530<>\"\",CD530<>\"\"),\"GS\",\"G\"),\"GS\")","v":"G"},null,null,null,null,null,"R301020307",{"$f":"COLUMN(O530)","v":15},{"$f":"LEFT(IF(O530=\"\",AZ530,O530),LEN(IF(O530=\"\",AZ530,O530))/2)","v":""},null,null,null,null,null,null,null,null,null,null,null,null,null,null,null,null,null,null,null,null,null,null,null,null,null,null,null,null,null,null,null,null,null,null,null,null,null,null,null,null,null,null,null,null,null,null,null,null,null,null,null,null,null,null,null,null,null,null,null,null,null,null,null,null,null,null,null,null,null,null,null,null,null,null,null,"x"]
[null,3,{"$f":"C530","v":"G"},null,null,null,null,-1,"R301020307Summa",{"$f":"\"L:\"&COLUMN(AS531)","v":"L:45"},{"$f":"RIGHT(IF(O530=\"\",AZ530,O530),LEN(IF(O530=\"\",AZ530,O530))/2)","v":""}]
[null,3]
[null,3,null,null,null,null,null,null,"R301020308",{"$f":"\"L:\"&COLUMN(AS533)","v":"L:45"},null,null,null,null,"Objekta ražošanas pašizmaksā iekļauto aizņēmuma procentu summa",null,null,null,null,null,null,null,null,null,null,null,null,null,null,null,null,null,null,null,null,null,null,null,null,null,null,null,null,null,null,null,null,null,null,null,null,"Objekta ražošanas pašizmaksā iekļauto aizņēmuma procentu summa"]
[null,3]
[null,3,null,null,null,null,null,null,null,null,null,null,null,null,"Bilances vērtība:",null,null,null,null,null,null,null,null,null,null,null,null,null,null,null,null,null,null,null,null,null,null,null,null,null,null,null,null,null,"Summa",null,null,null,null,null,null,"Bilances vērtība:",null,null,null,null,null,null,null,null,null,null,null,null,null,null,null,null,null,null,null,null,null,null,null,null,null,null,null,null,null,"Summa"]
[null,3,{"$f":"IFERROR(IF(OR(COUNT(AS536:AU537)>0,COUNT(CD536:CF537)>0),\"GS\",\"G\"),\"GS\")","v":"G"},null,null,null,null,null,"R30102030801",{"$f":"\"L:\"&COLUMN(AS536)","v":"L:45"},null,null,null,null,"pārskata gada sākumā",null,null,null,null,null,null,null,null,null,null,null,null,null,null,null,null,null,null,null,null,null,null,null,null,null,null,null,null,null,null,null,null,null,null,null,null,"pārskata gada sākumā"]
[null,3,{"$f":"C536","v":"G"},null,null,null,null,null,"R30102030802",{"$f":"\"L:\"&COLUMN(AS537)","v":"L:45"},null,null,null,null,"pārskata gada beigās",null,null,null,null,null,null,null,null,null,null,null,null,null,null,null,null,null,null,null,null,null,null,null,null,null,null,null,null,null,null,null,null,null,null,null,null,"pārskata gada beigās"]
[null,3]
[null,3,null,null,null,"x","x",null,null,null,null,null,null,"3.1.2.4.","pārējie pamatlīdzekļi un inventārs (informācija par bilances posteni \"Pārējie pamatlīdzekļi un inventārs\")",null,null,null,null,null,null,null,null,null,null,null,null,null,null,null,null,null,null,null,null,null,null,null,null,null,null,null,null,null,null,null,null,null,null,null,"3.1.2.4.","pārējie pamatlīdzekļi un inventārs (informācija par bilances posteni \"Pārējie pamatlīdzekļi un inventārs\")"]
[null,3,null,null,null,null,null,null,null,null,null,null,null,null,"Iegādes izmaksas vai ražošanas pašizmaksa:",null,null,null,null,null,null,null,null,null,null,null,null,null,null,null,null,null,null,null,null,null,null,null,null,null,null,null,null,null,"Summa",null,null,null,null,null,null,"Iegādes izmaksas vai ražošanas pašizmaksa:",null,null,null,null,null,null,null,null,null,null,null,null,null,null,null,null,null,null,null,null,null,null,null,null,null,null,null,null,null,"Summa"]
[null,3,{"$f":"IFERROR(IF(OR(COUNT(AS541:AU542)>0,COUNT(CD541:CF542)>0),\"GS\",\"G\"),\"GS\")","v":"G"},null,null,null,null,null,"R30102040101",{"$f":"\"L:\"&COLUMN(AS541)","v":"L:45"},null,null,null,null,"pārskata gada sākumā",null,null,null,null,null,null,null,null,null,null,null,null,null,null,null,null,null,null,null,null,null,null,null,null,null,null,null,null,null,null,null,null,null,null,null,null,"pārskata gada sākumā"]
[null,3,{"$f":"C541","v":"G"},null,null,null,null,null,"R30102040102",{"$f":"\"L:\"&COLUMN(AS542)","v":"L:45"},null,null,null,null,"pārskata gada beigās",null,null,null,null,null,null,null,null,null,null,null,null,null,null,null,null,null,null,null,null,null,null,null,null,null,null,null,null,null,null,null,null,null,null,null,null,"pārskata gada beigās"]
[null,3,{"$f":"C544","v":""}]
[null,3,{"$f":"IF(C545=\"GS\",\"S\",\"\")","v":""},null,null,null,null,null,null,null,null,null,null,null,"Vērtības palielinājumi, ieskaitot uzlabojumus",null,null,null,null,null,null,null,null,null,null,null,null,null,null,null,null,null,null,null,null,null,null,null,null,null,null,null,null,null,"Summa",null,null,null,null,null,null,"Vērtības palielinājumi, ieskaitot uzlabojumus",null,null,null,null,null,null,null,null,null,null,null,null,null,null,null,null,null,null,null,null,null,null,null,null,null,null,null,null,null,"Summa"]
[null,3,{"$f":"IFERROR(IF(OR(AS545<>\"\",CD545<>\"\"),\"GS\",\"G\"),\"GS\")","v":"G"},null,null,null,null,null,"R301020402",{"$f":"COLUMN(P545)","v":16},{"$f":"LEFT(IF(O545=\"\",AZ545,O545),LEN(IF(O545=\"\",AZ545,O545))/2)","v":""},null,null,null,null,null,null,null,null,null,null,null,null,null,null,null,null,null,null,null,null,null,null,null,null,null,null,null,null,null,null,null,null,null,null,null,null,null,null,null,null,null,null,null,null,null,null,null,null,null,null,null,null,null,null,null,null,null,null,null,null,null,null,null,null,null,null,null,null,null,null,null,null,null,null,null,"x"]
[null,3,{"$f":"C545","v":"G"},null,null,null,null,-1,"R301020402Summa",{"$f":"\"L:\"&COLUMN(AS546)","v":"L:45"},{"$f":"RIGHT(IF(O545=\"\",AZ545,O545),LEN(IF(O545=\"\",AZ545,O545))/2)","v":""}]
[null,3,{"$f":"C548","v":""}]
[null,3,{"$f":"IF(C549=\"GS\",\"S\",\"\")","v":""},null,null,null,null,null,null,null,null,null,null,null,"Atsavināšana vai likvidācija pārskata gadā",null,null,null,null,null,null,null,null,null,null,null,null,null,null,null,null,null,null,null,null,null,null,null,null,null,null,null,null,null,"Summa",null,null,null,null,null,null,"Atsavināšana vai likvidācija pārskata gadā",null,null,null,null,null,null,null,null,null,null,null,null,null,null,null,null,null,null,null,null,null,null,null,null,null,null,null,null,null,"Summa"]
[null,3,{"$f":"IFERROR(IF(OR(AS549<>\"\",CD549<>\"\"),\"GS\",\"G\"),\"GS\")","v":"G"},null,null,null,null,null,"R301020403",{"$f":"COLUMN(P549)","v":16},{"$f":"LEFT(IF(O549=\"\",AZ549,O549),LEN(IF(O549=\"\",AZ549,O549))/2)","v":""},null,null,null,null,null,null,null,null,null,null,null,null,null,null,null,null,null,null,null,null,null,null,null,null,null,null,null,null,null,null,null,null,null,null,null,null,null,null,null,null,null,null,null,null,null,null,null,null,null,null,null,null,null,null,null,null,null,null,null,null,null,null,null,null,null,null,null,null,null,null,null,null,null,null,null,"x"]
[null,3,{"$f":"C549","v":"G"},null,null,null,null,-1,"R301020403Summa",{"$f":"\"L:\"&COLUMN(AS550)","v":"L:45"},{"$f":"RIGHT(IF(O549=\"\",AZ549,O549),LEN(IF(O549=\"\",AZ549,O549))/2)","v":""}]
[null,3,{"$f":"C552","v":""}]
[null,3,{"$f":"IF(C553=\"GS\",\"S\",\"\")","v":""},null,null,null,null,null,null,null,null,null,null,null,"Pārvietošana uz citu bilances posteni",null,null,null,null,null,null,null,null,null,null,null,null,null,null,null,null,null,null,null,null,null,null,null,null,null,null,null,null,null,"Summa",null,null,null,null,null,null,"Pārvietošana uz citu bilances posteni",null,null,null,null,null,null,null,null,null,null,null,null,null,null,null,null,null,null,null,null,null,null,null,null,null,null,null,null,null,"Summa"]
[null,3,{"$f":"IFERROR(IF(OR(AS553<>\"\",CD553<>\"\"),\"GS\",\"G\"),\"GS\")","v":"G"},null,null,null,null,null,"R301020404",{"$f":"COLUMN(P553)","v":16},{"$f":"LEFT(IF(O553=\"\",AZ553,O553),LEN(IF(O553=\"\",AZ553,O553))/2)","v":""},null,null,null,null,null,null,null,null,null,null,null,null,null,null,null,null,null,null,null,null,null,null,null,null,null,null,null,null,null,null,null,null,null,null,null,null,null,null,null,null,null,null,null,null,null,null,null,null,null,null,null,null,null,null,null,null,null,null,null,null,null,null,null,null,null,null,null,null,null,null,null,null,null,null,null,"x"]
[null,3,{"$f":"C553","v":"G"},null,null,null,null,-1,"R301020404Summa",{"$f":"\"L:\"&COLUMN(AS554)","v":"L:45"},{"$f":"RIGHT(IF(O553=\"\",AZ553,O553),LEN(IF(O553=\"\",AZ553,O553))/2)","v":""}]
[null,3]
[null,3,null,null,null,null,null,null,null,null,null,null,null,null,"Uzkrātās vērtības samazinājuma korekcijas:",null,null,null,null,null,null,null,null,null,null,null,null,null,null,null,null,null,null,null,null,null,null,null,null,null,null,null,null,null,"Summa",null,null,null,null,null,null,"Uzkrātās vērtības samazinājuma korekcijas:",null,null,null,null,null,null,null,null,null,null,null,null,null,null,null,null,null,null,null,null,null,null,null,null,null,null,null,null,null,"Summa"]
[null,3,{"$f":"IFERROR(IF(OR(COUNT(AS557:AU558)>0,COUNT(CD557:CF558)>0),\"GS\",\"G\"),\"GS\")","v":"G"},null,null,null,null,null,"R30102040501",{"$f":"\"L:\"&COLUMN(AS557)","v":"L:45"},null,null,null,null,"pārskata gada sākumā",null,null,null,null,null,null,null,null,null,null,null,null,null,null,null,null,null,null,null,null,null,null,null,null,null,null,null,null,null,null,null,null,null,null,null,null,"pārskata gada sākumā"]
[null,3,{"$f":"C557","v":"G"},null,null,null,null,null,"R30102040502",{"$f":"\"L:\"&COLUMN(AS558)","v":"L:45"},null,null,null,null,"pārskata gada beigās",null,null,null,null,null,null,null,null,null,null,null,null,null,null,null,null,null,null,null,null,null,null,null,null,null,null,null,null,null,null,null,null,null,null,null,null,"pārskata gada beigās"]
[null,3,{"$f":"C560","v":""}]
[null,3,{"$f":"IF(C561=\"GS\",\"S\",\"\")","v":""},null,null,null,null,null,null,null,null,null,null,null,"Pārskata gadā aprēķinātās vērtības samazinājuma korekcijas",null,null,null,null,null,null,null,null,null,null,null,null,null,null,null,null,null,null,null,null,null,null,null,null,null,null,null,null,null,"Summa",null,null,null,null,null,null,"Pārskata gadā aprēķinātās vērtības samazinājuma korekcijas",null,null,null,null,null,null,null,null,null,null,null,null,null,null,null,null,null,null,null,null,null,null,null,null,null,null,null,null,null,"Summa"]
[null,3,{"$f":"IFERROR(IF(OR(AS561<>\"\",CD561<>\"\"),\"GS\",\"G\"),\"GS\")","v":"G"},null,null,null,null,null,"R301020406",{"$f":"COLUMN(P561)","v":16},{"$f":"LEFT(IF(O561=\"\",AZ561,O561),LEN(IF(O561=\"\",AZ561,O561))/2)","v":""},null,null,null,null,null,null,null,null,null,null,null,null,null,null,null,null,null,null,null,null,null,null,null,null,null,null,null,null,null,null,null,null,null,null,null,null,null,null,null,null,null,null,null,null,null,null,null,null,null,null,null,null,null,null,null,null,null,null,null,null,null,null,null,null,null,null,null,null,null,null,null,null,null,null,null,"x"]
[null,3,{"$f":"C561","v":"G"},null,null,null,null,-1,"R301020406Summa",{"$f":"\"L:\"&COLUMN(AS562)","v":"L:45"},{"$f":"RIGHT(IF(O561=\"\",AZ561,O561),LEN(IF(O561=\"\",AZ561,O561))/2)","v":""}]
[null,3,{"$f":"C564","v":""}]
[null,3,{"$f":"IF(C565=\"GS\",\"S\",\"\")","v":""},null,null,null,null,null,null,null,null,null,null,null,"Uzkrāto vērtības samazinājuma korekciju kopsummas izmaiņas saistībā ar objekta atsavināšanu, likvidāciju vai pārvietošanu uz citu posteni",null,null,null,null,null,null,null,null,null,null,null,null,null,null,null,null,null,null,null,null,null,null,null,null,null,null,null,null,null,"Summa",null,null,null,null,null,null,"Uzkrāto vērtības samazinājuma korekciju kopsummas izmaiņas saistībā ar objekta atsavināšanu, likvidāciju vai pārvietošanu uz citu posteni",null,null,null,null,null,null,null,null,null,null,null,null,null,null,null,null,null,null,null,null,null,null,null,null,null,null,null,null,null,"Summa"]
[null,3,{"$f":"IFERROR(IF(OR(AS565<>\"\",CD565<>\"\"),\"GS\",\"G\"),\"GS\")","v":"G"},null,null,null,null,null,"R301020407",{"$f":"COLUMN(P565)","v":16},{"$f":"LEFT(IF(O565=\"\",AZ565,O565),LEN(IF(O565=\"\",AZ565,O565))/2)","v":""},null,null,null,null,null,null,null,null,null,null,null,null,null,null,null,null,null,null,null,null,null,null,null,null,null,null,null,null,null,null,null,null,null,null,null,null,null,null,null,null,null,null,null,null,null,null,null,null,null,null,null,null,null,null,null,null,null,null,null,null,null,null,null,null,null,null,null,null,null,null,null,null,null,null,null,"x"]
[null,3,{"$f":"C565","v":"G"},null,null,null,null,-1,"R301020407Summa",{"$f":"\"L:\"&COLUMN(AS566)","v":"L:45"},{"$f":"RIGHT(IF(O565=\"\",AZ565,O565),LEN(IF(O565=\"\",AZ565,O565))/2)","v":""}]
[null,3]
[null,3,null,null,null,null,null,null,"R301020408",{"$f":"\"L:\"&COLUMN(AS568)","v":"L:45"},null,null,null,null,"Objekta ražošanas pašizmaksā iekļauto aizņēmuma procentu summa",null,null,null,null,null,null,null,null,null,null,null,null,null,null,null,null,null,null,null,null,null,null,null,null,null,null,null,null,null,null,null,null,null,null,null,null,"Objekta ražošanas pašizmaksā iekļauto aizņēmuma procentu summa"]
[null,3]
[null,3,null,null,null,null,null,null,null,null,null,null,null,null,"Bilances vērtība:",null,null,null,null,null,null,null,null,null,null,null,null,null,null,null,null,null,null,null,null,null,null,null,null,null,null,null,null,null,"Summa",null,null,null,null,null,null,"Bilances vērtība:",null,null,null,null,null,null,null,null,null,null,null,null,null,null,null,null,null,null,null,null,null,null,null,null,null,null,null,null,null,"Summa"]
[null,3,{"$f":"IFERROR(IF(OR(COUNT(AS571:AU572)>0,COUNT(CD571:CF572)>0),\"GS\",\"G\"),\"GS\")","v":"G"},null,null,null,null,null,"R30102040801",{"$f":"\"L:\"&COLUMN(AS571)","v":"L:45"},null,null,null,null,"pārskata gada sākumā",null,null,null,null,null,null,null,null,null,null,null,null,null,null,null,null,null,null,null,null,null,null,null,null,null,null,null,null,null,null,null,null,null,null,null,null,"pārskata gada sākumā"]
[null,3,{"$f":"C571","v":"G"},null,null,null,null,null,"R30102040802",{"$f":"\"L:\"&COLUMN(AS572)","v":"L:45"},null,null,null,null,"pārskata gada beigās",null,null,null,null,null,null,null,null,null,null,null,null,null,null,null,null,null,null,null,null,null,null,null,null,null,null,null,null,null,null,null,null,null,null,null,null,"pārskata gada beigās"]
[null,3,{"$f":"C574","v":""}]
[null,3,{"$f":"IF(C575=\"GS\",\"S\",\"\")","v":""},null,null,null,null,null,null,null,null,null,null,null,"Papildus sniegtā informācija, ja tāda ir",null,null,null,null,null,null,null,null,null,null,null,null,null,null,null,null,null,null,null,null,null,null,null,null,null,null,null,null,null,null,null,null,null,null,null,null,"Papildus sniegtā informācija, ja tāda ir"]
[null,3,{"$f":"IFERROR(IF(OR(O575<>\"\",AZ575<>\"\"),\"GS\",\"G\"),\"GS\")","v":"G"},null,null,null,null,null,"R3010205",{"$f":"COLUMN(O575)","v":15},{"$f":"LEFT(IF(O575=\"\",AZ575,O575),LEN(IF(O575=\"\",AZ575,O575))/2)","v":""},null,null,null,null,null,null,null,null,null,null,null,null,null,null,null,null,null,null,null,null,null,null,null,null,null,null,null,null,null,null,null,null,null,null,null,null,null,null,null,null,null,null,null,null,null,null,null,null,null,null,null,null,null,null,null,null,null,null,null,null,null,null,null,null,null,null,null,null,null,null,null,null,null,null,null,"x"]
[null,3,{"$f":"C575","v":"G"},null,null,null,null,null,null,{"$f":"COLUMN(O576)","v":15},{"$f":"RIGHT(IF(O575=\"\",AZ575,O575),LEN(IF(O575=\"\",AZ575,O575))/2)","v":""}]
[null,3]
[null,3,{"$f":"C579","v":""},null,null,"x","x",null,null,null,null,null,null,"3.1.3.","ilgtermiņa finanšu ieguldījumi",null,null,null,null,null,null,null,null,null,null,null,null,null,null,null,null,null,null,null,null,null,null,null,null,null,null,null,null,null,null,null,null,null,null,null,"3.1.3.","ilgtermiņa finanšu ieguldījumi"]
[null,3,{"$f":"C580","v":""},null,null,"x","x",null,null,null,null,null,null,"3.1.3.1.","Postenis1",null,null,null,null,null,null,null,null,null,null,null,null,null,null,null,null,null,null,null,null,null,null,null,null,null,null,null,null,null,null,null,null,null,null,null,"3.1.3.1.","Postenis1"]
[null,3,{"$f":"IF(C581=\"GS\",\"S\",\"\")","v":""},null,null,null,null,null,{"$f":"COUNTA(O581,AS585:AU586,O589:AU590,O593:AU594,O597:AU598,AS601:AU602,O605:AU606,AS608,AS611:AU612,O615)","v":0},null,null,null,null,null,"Norāde, par kādu bilances posteni tiks sniegta informācija",null,null,null,null,null,null,null,null,null,null,null,null,null,null,null,null,null,null,null,null,null,null,null,null,null,null,null,null,null,null,null,null,null,null,null,null,"Norāde, par kādu bilances posteni tiks sniegta informācija"]
[null,3,{"$f":"IFERROR(IF(OR(O581<>\"\",AZ581<>\"\"),\"GS\",\"G\"),\"GS\")","v":"G"},null,null,null,null,null,"R30103_P1_R00",{"$f":"COLUMN(O581)","v":15},{"$f":"LEFT(IF(O581=\"\",AZ581,O581),LEN(IF(O581=\"\",AZ581,O581))/2)","v":""},null,null,null,null,null,null,null,null,null,null,null,null,null,null,null,null,null,null,null,null,null,null,null,null,null,null,null,null,null,null,null,null,null,null,null,null,null,null,null,null,null,null,null,null,null,null,null,null,null,null,null,null,null,null,null,null,null,null,null,null,null,null,null,null,null,null,null,null,null,null,null,null,null,null,null,"x"]
[null,3,{"$f":"C581","v":"G"},null,null,null,null,null,null,{"$f":"COLUMN(O582)","v":15},{"$f":"RIGHT(IF(O581=\"\",AZ581,O581),LEN(IF(O581=\"\",AZ581,O581))/2)","v":""}]
[null,3]
[null,3,null,null,null,null,null,null,null,null,null,null,null,null,"Iegādes izmaksas vai ražošanas pašizmaksa:",null,null,null,null,null,null,null,null,null,null,null,null,null,null,null,null,null,null,null,null,null,null,null,null,null,null,null,null,null,"Summa",null,null,null,null,null,null,"Iegādes izmaksas vai ražošanas pašizmaksa:",null,null,null,null,null,null,null,null,null,null,null,null,null,null,null,null,null,null,null,null,null,null,null,null,null,null,null,null,null,"Summa"]
[null,3,{"$f":"IFERROR(IF(OR(COUNT(AS585:AU586)>0,COUNT(CD585:CF586)>0),\"GS\",\"G\"),\"GS\")","v":"G"},null,null,null,null,null,"R30103_P1_R0101",{"$f":"\"L:\"&COLUMN(AS585)","v":"L:45"},null,null,null,null,"pārskata gada sākumā",null,null,null,null,null,null,null,null,null,null,null,null,null,null,null,null,null,null,null,null,null,null,null,null,null,null,null,null,null,null,null,null,null,null,null,null,"pārskata gada sākumā"]
[null,3,{"$f":"C585","v":"G"},null,null,null,null,null,"R30103_P1_R0102",{"$f":"\"L:\"&COLUMN(AS586)","v":"L:45"},null,null,null,null,"pārskata gada beigās",null,null,null,null,null,null,null,null,null,null,null,null,null,null,null,null,null,null,null,null,null,null,null,null,null,null,null,null,null,null,null,null,null,null,null,null,"pārskata gada beigās"]
[null,3,{"$f":"C588","v":""}]
[null,3,{"$f":"IF(C589=\"GS\",\"S\",\"\")","v":""},null,null,null,null,null,null,null,null,null,null,null,"Vērtības palielinājumi, ieskaitot uzlabojumus",null,null,null,null,null,null,null,null,null,null,null,null,null,null,null,null,null,null,null,null,null,null,null,null,null,null,null,null,null,"Summa",null,null,null,null,null,null,"Vērtības palielinājumi, ieskaitot uzlabojumus",null,null,null,null,null,null,null,null,null,null,null,null,null,null,null,null,null,null,null,null,null,null,null,null,null,null,null,null,null,"Summa"]
[null,3,{"$f":"IFERROR(IF(OR(AS589<>\"\",CD589<>\"\"),\"GS\",\"G\"),\"GS\")","v":"G"},null,null,null,null,null,"R30103_P1_R02",{"$f":"COLUMN(O589)","v":15},{"$f":"LEFT(IF(O589=\"\",AZ589,O589),LEN(IF(O589=\"\",AZ589,O589))/2)","v":""},null,null,null,null,null,null,null,null,null,null,null,null,null,null,null,null,null,null,null,null,null,null,null,null,null,null,null,null,null,null,null,null,null,null,null,null,null,null,null,null,null,null,null,null,null,null,null,null,null,null,null,null,null,null,null,null,null,null,null,null,null,null,null,null,null,null,null,null,null,null,null,null,null,null,null,"x"]
[null,3,{"$f":"C589","v":"G"},null,null,null,null,-1,"R30103_P1_R02Summa",{"$f":"\"L:\"&COLUMN(AS590)","v":"L:45"},{"$f":"RIGHT(IF(O589=\"\",AZ589,O589),LEN(IF(O589=\"\",AZ589,O589))/2)","v":""}]
[null,3,{"$f":"C592","v":""}]
[null,3,{"$f":"IF(C593=\"GS\",\"S\",\"\")","v":""},null,null,null,null,null,null,null,null,null,null,null,"Atsavināšana vai likvidācija pārskata gadā",null,null,null,null,null,null,null,null,null,null,null,null,null,null,null,null,null,null,null,null,null,null,null,null,null,null,null,null,null,"Summa",null,null,null,null,null,null,"Atsavināšana vai likvidācija pārskata gadā",null,null,null,null,null,null,null,null,null,null,null,null,null,null,null,null,null,null,null,null,null,null,null,null,null,null,null,null,null,"Summa"]
[null,3,{"$f":"IFERROR(IF(OR(AS593<>\"\",CD593<>\"\"),\"GS\",\"G\"),\"GS\")","v":"G"},null,null,null,null,null,"R30103_P1_R03",{"$f":"COLUMN(O593)","v":15},{"$f":"LEFT(IF(O593=\"\",AZ593,O593),LEN(IF(O593=\"\",AZ593,O593))/2)","v":""},null,null,null,null,null,null,null,null,null,null,null,null,null,null,null,null,null,null,null,null,null,null,null,null,null,null,null,null,null,null,null,null,null,null,null,null,null,null,null,null,null,null,null,null,null,null,null,null,null,null,null,null,null,null,null,null,null,null,null,null,null,null,null,null,null,null,null,null,null,null,null,null,null,null,null,"x"]
[null,3,{"$f":"C593","v":"G"},null,null,null,null,-1,"R30103_P1_R03Summa",{"$f":"\"L:\"&COLUMN(AS594)","v":"L:45"},{"$f":"RIGHT(IF(O593=\"\",AZ593,O593),LEN(IF(O593=\"\",AZ593,O593))/2)","v":""}]
[null,3,{"$f":"C596","v":""}]
[null,3,{"$f":"IF(C597=\"GS\",\"S\",\"\")","v":""},null,null,null,null,null,null,null,null,null,null,null,"Pārvietošana uz citu bilances posteni",null,null,null,null,null,null,null,null,null,null,null,null,null,null,null,null,null,null,null,null,null,null,null,null,null,null,null,null,null,"Summa",null,null,null,null,null,null,"Pārvietošana uz citu bilances posteni",null,null,null,null,null,null,null,null,null,null,null,null,null,null,null,null,null,null,null,null,null,null,null,null,null,null,null,null,null,"Summa"]
[null,3,{"$f":"IFERROR(IF(OR(AS597<>\"\",CD597<>\"\"),\"GS\",\"G\"),\"GS\")","v":"G"},null,null,null,null,null,"R30103_P1_R04",{"$f":"COLUMN(O597)","v":15},{"$f":"LEFT(IF(O597=\"\",AZ597,O597),LEN(IF(O597=\"\",AZ597,O597))/2)","v":""},null,null,null,null,null,null,null,null,null,null,null,null,null,null,null,null,null,null,null,null,null,null,null,null,null,null,null,null,null,null,null,null,null,null,null,null,null,null,null,null,null,null,null,null,null,null,null,null,null,null,null,null,null,null,null,null,null,null,null,null,null,null,null,null,null,null,null,null,null,null,null,null,null,null,null,"x"]
[null,3,{"$f":"C597","v":"G"},null,null,null,null,-1,"R30103_P1_R04Summa",{"$f":"\"L:\"&COLUMN(AS598)","v":"L:45"},{"$f":"RIGHT(IF(O597=\"\",AZ597,O597),LEN(IF(O597=\"\",AZ597,O597))/2)","v":""}]
[null,3]
[null,3,null,null,null,null,null,null,null,null,null,null,null,null,"Uzkrātās vērtības samazinājuma korekcijas:",null,null,null,null,null,null,null,null,null,null,null,null,null,null,null,null,null,null,null,null,null,null,null,null,null,null,null,null,null,"Summa",null,null,null,null,null,null,"Uzkrātās vērtības samazinājuma korekcijas:",null,null,null,null,null,null,null,null,null,null,null,null,null,null,null,null,null,null,null,null,null,null,null,null,null,null,null,null,null,"Summa"]
[null,3,{"$f":"IFERROR(IF(OR(COUNT(AS601:AU602)>0,COUNT(CD601:CF602)>0),\"GS\",\"G\"),\"GS\")","v":"G"},null,null,null,null,null,"R30103_P1_R0501",{"$f":"\"L:\"&COLUMN(AS601)","v":"L:45"},null,null,null,null,"pārskata gada sākumā",null,null,null,null,null,null,null,null,null,null,null,null,null,null,null,null,null,null,null,null,null,null,null,null,null,null,null,null,null,null,null,null,null,null,null,null,"pārskata gada sākumā"]
[null,3,{"$f":"C601","v":"G"},null,null,null,null,null,"R30103_P1_R0502",{"$f":"\"L:\"&COLUMN(AS602)","v":"L:45"},null,null,null,null,"pārskata gada beigās",null,null,null,null,null,null,null,null,null,null,null,null,null,null,null,null,null,null,null,null,null,null,null,null,null,null,null,null,null,null,null,null,null,null,null,null,"pārskata gada beigās"]
[null,3,{"$f":"C604","v":""}]
[null,3,{"$f":"IF(C605=\"GS\",\"S\",\"\")","v":""},null,null,null,null,null,null,null,null,null,null,null,"Pārskata gadā aprēķinātās vērtības samazinājuma korekcijas",null,null,null,null,null,null,null,null,null,null,null,null,null,null,null,null,null,null,null,null,null,null,null,null,null,null,null,null,null,"Summa",null,null,null,null,null,null,"Pārskata gadā aprēķinātās vērtības samazinājuma korekcijas",null,null,null,null,null,null,null,null,null,null,null,null,null,null,null,null,null,null,null,null,null,null,null,null,null,null,null,null,null,"Summa"]
[null,3,{"$f":"IFERROR(IF(OR(AS605<>\"\",CD605<>\"\"),\"GS\",\"G\"),\"GS\")","v":"G"},null,null,null,null,null,"R30103_P1_R06",{"$f":"COLUMN(O605)","v":15},{"$f":"LEFT(IF(O605=\"\",AZ605,O605),LEN(IF(O605=\"\",AZ605,O605))/2)","v":""},null,null,null,null,null,null,null,null,null,null,null,null,null,null,null,null,null,null,null,null,null,null,null,null,null,null,null,null,null,null,null,null,null,null,null,null,null,null,null,null,null,null,null,null,null,null,null,null,null,null,null,null,null,null,null,null,null,null,null,null,null,null,null,null,null,null,null,null,null,null,null,null,null,null,null,"x"]
[null,3,{"$f":"C605","v":"G"},null,null,null,null,-1,"R30103_P1_R06Summa",{"$f":"\"L:\"&COLUMN(AS606)","v":"L:45"},{"$f":"RIGHT(IF(O605=\"\",AZ605,O605),LEN(IF(O605=\"\",AZ605,O605))/2)","v":""}]
[null,3]
[null,3,null,null,null,null,null,null,"R30103_P1_R07",{"$f":"\"L:\"&COLUMN(AS608)","v":"L:45"},null,null,null,null,"Uzkrāto vērtības samazinājuma korekciju kopsummas izmaiņas saistībā ar objekta atsavināšanu, likvidāciju vai pārvietošanu uz citu posteni",null,null,null,null,null,null,null,null,null,null,null,null,null,null,null,null,null,null,null,null,null,null,null,null,null,null,null,null,null,null,null,null,null,null,null,null,"Uzkrāto vērtības samazinājuma korekciju kopsummas izmaiņas saistībā ar objekta atsavināšanu, likvidāciju vai pārvietošanu uz citu posteni"]
[null,3]
[null,3,null,null,null,null,null,null,null,null,null,null,null,null,"Bilances vērtība:",null,null,null,null,null,null,null,null,null,null,null,null,null,null,null,null,null,null,null,null,null,null,null,null,null,null,null,null,null,"Summa",null,null,null,null,null,null,"Bilances vērtība:",null,null,null,null,null,null,null,null,null,null,null,null,null,null,null,null,null,null,null,null,null,null,null,null,null,null,null,null,null,"Summa"]
[null,3,{"$f":"IFERROR(IF(OR(COUNT(AS611:AU612)>0,COUNT(CD611:CF612)>0),\"GS\",\"G\"),\"GS\")","v":"G"},null,null,null,null,null,"R30103_P1_R0701",{"$f":"\"L:\"&COLUMN(AS611)","v":"L:45"},null,null,null,null,"pārskata gada sākumā",null,null,null,null,null,null,null,null,null,null,null,null,null,null,null,null,null,null,null,null,null,null,null,null,null,null,null,null,null,null,null,null,null,null,null,null,"pārskata gada sākumā"]
[null,3,{"$f":"C611","v":"G"},null,null,null,null,null,"R30103_P1_R0702",{"$f":"\"L:\"&COLUMN(AS612)","v":"L:45"},null,null,null,null,"pārskata gada beigās",null,null,null,null,null,null,null,null,null,null,null,null,null,null,null,null,null,null,null,null,null,null,null,null,null,null,null,null,null,null,null,null,null,null,null,null,"pārskata gada beigās"]
[null,3,{"$f":"C614","v":""}]
[null,3,{"$f":"IF(C615=\"GS\",\"S\",\"\")","v":""},null,null,null,null,null,null,null,null,null,null,null,"Papildus sniegtā informācija, ja tāda ir",null,null,null,null,null,null,null,null,null,null,null,null,null,null,null,null,null,null,null,null,null,null,null,null,null,null,null,null,null,null,null,null,null,null,null,null,"Papildus sniegtā informācija, ja tāda ir"]
[null,3,{"$f":"IFERROR(IF(OR(O615<>\"\",AZ615<>\"\"),\"GS\",\"G\"),\"GS\")","v":"G"},null,null,null,null,null,"R30103_P1_R08",{"$f":"COLUMN(O615)","v":15},{"$f":"LEFT(IF(O615=\"\",AZ615,O615),LEN(IF(O615=\"\",AZ615,O615))/2)","v":""},null,null,null,null,null,null,null,null,null,null,null,null,null,null,null,null,null,null,null,null,null,null,null,null,null,null,null,null,null,null,null,null,null,null,null,null,null,null,null,null,null,null,null,null,null,null,null,null,null,null,null,null,null,null,null,null,null,null,null,null,null,null,null,null,null,null,null,null,null,null,null,null,null,null,null,"x"]
[null,3,{"$f":"C615","v":"G"},null,null,null,null,null,null,{"$f":"COLUMN(O616)","v":15},{"$f":"RIGHT(IF(O615=\"\",AZ615,O615),LEN(IF(O615=\"\",AZ615,O615))/2)","v":""}]
[null,3,{"$f":"C618","v":""}]
[null,3,{"$f":"C619","v":""},null,null,"x","x",null,null,null,null,null,null,"3.1.3.2.","Postenis2",null,null,null,null,null,null,null,null,null,null,null,null,null,null,null,null,null,null,null,null,null,null,null,null,null,null,null,null,null,null,null,null,null,null,null,"3.1.3.2.","Postenis2"]
[null,3,{"$f":"IF(C620=\"GS\",\"S\",\"\")","v":""},null,null,null,null,null,{"$f":"COUNTA(O620,AS624:AU625,O628:AU629,O632:AU633,O636:AU637,AS640:AU641,O644:AU645,AS647,AS650:AU651,O654)","v":0},null,null,null,null,null,"Norāde, par kādu bilances posteni tiks sniegta informācija",null,null,null,null,null,null,null,null,null,null,null,null,null,null,null,null,null,null,null,null,null,null,null,null,null,null,null,null,null,null,null,null,null,null,null,null,"Norāde, par kādu bilances posteni tiks sniegta informācija"]
[null,3,{"$f":"IFERROR(IF(OR(O620<>\"\",AZ620<>\"\"),\"GS\",\"G\"),\"GS\")","v":"G"},null,null,null,null,null,"R30103_P2_R00",{"$f":"COLUMN(O620)","v":15},{"$f":"LEFT(IF(O620=\"\",AZ620,O620),LEN(IF(O620=\"\",AZ620,O620))/2)","v":""},null,null,null,null,null,null,null,null,null,null,null,null,null,null,null,null,null,null,null,null,null,null,null,null,null,null,null,null,null,null,null,null,null,null,null,null,null,null,null,null,null,null,null,null,null,null,null,null,null,null,null,null,null,null,null,null,null,null,null,null,null,null,null,null,null,null,null,null,null,null,null,null,null,null,null,"x"]
[null,3,{"$f":"C620","v":"G"},null,null,null,null,null,null,{"$f":"COLUMN(O621)","v":15},{"$f":"RIGHT(IF(O620=\"\",AZ620,O620),LEN(IF(O620=\"\",AZ620,O620))/2)","v":""}]
[null,3]
[null,3,null,null,null,null,null,null,null,null,null,null,null,null,"Iegādes izmaksas vai ražošanas pašizmaksa:",null,null,null,null,null,null,null,null,null,null,null,null,null,null,null,null,null,null,null,null,null,null,null,null,null,null,null,null,null,"Summa",null,null,null,null,null,null,"Iegādes izmaksas vai ražošanas pašizmaksa:",null,null,null,null,null,null,null,null,null,null,null,null,null,null,null,null,null,null,null,null,null,null,null,null,null,null,null,null,null,"Summa"]
[null,3,{"$f":"IFERROR(IF(OR(COUNT(AS624:AU625)>0,COUNT(CD624:CF625)>0),\"GS\",\"G\"),\"GS\")","v":"G"},null,null,null,null,null,"R30103_P2_R0101",{"$f":"\"L:\"&COLUMN(AS624)","v":"L:45"},null,null,null,null,"pārskata gada sākumā",null,null,null,null,null,null,null,null,null,null,null,null,null,null,null,null,null,null,null,null,null,null,null,null,null,null,null,null,null,null,null,null,null,null,null,null,"pārskata gada sākumā"]
[null,3,{"$f":"C624","v":"G"},null,null,null,null,null,"R30103_P2_R0102",{"$f":"\"L:\"&COLUMN(AS625)","v":"L:45"},null,null,null,null,"pārskata gada beigās",null,null,null,null,null,null,null,null,null,null,null,null,null,null,null,null,null,null,null,null,null,null,null,null,null,null,null,null,null,null,null,null,null,null,null,null,"pārskata gada beigās"]
[null,3,{"$f":"C627","v":""}]
[null,3,{"$f":"IF(C628=\"GS\",\"S\",\"\")","v":""},null,null,null,null,null,null,null,null,null,null,null,"Vērtības palielinājumi, ieskaitot uzlabojumus",null,null,null,null,null,null,null,null,null,null,null,null,null,null,null,null,null,null,null,null,null,null,null,null,null,null,null,null,null,"Summa",null,null,null,null,null,null,"Vērtības palielinājumi, ieskaitot uzlabojumus",null,null,null,null,null,null,null,null,null,null,null,null,null,null,null,null,null,null,null,null,null,null,null,null,null,null,null,null,null,"Summa"]
[null,3,{"$f":"IFERROR(IF(OR(AS628<>\"\",CD628<>\"\"),\"GS\",\"G\"),\"GS\")","v":"G"},null,null,null,null,null,"R30103_P2_R02",{"$f":"COLUMN(O628)","v":15},{"$f":"LEFT(IF(O628=\"\",AZ628,O628),LEN(IF(O628=\"\",AZ628,O628))/2)","v":""},null,null,null,null,null,null,null,null,null,null,null,null,null,null,null,null,null,null,null,null,null,null,null,null,null,null,null,null,null,null,null,null,null,null,null,null,null,null,null,null,null,null,null,null,null,null,null,null,null,null,null,null,null,null,null,null,null,null,null,null,null,null,null,null,null,null,null,null,null,null,null,null,null,null,null,"x"]
[null,3,{"$f":"C628","v":"G"},null,null,null,null,-1,"R30103_P2_R02Summa",{"$f":"\"L:\"&COLUMN(AS629)","v":"L:45"},{"$f":"RIGHT(IF(O628=\"\",AZ628,O628),LEN(IF(O628=\"\",AZ628,O628))/2)","v":""}]
[null,3,{"$f":"C631","v":""}]
[null,3,{"$f":"IF(C632=\"GS\",\"S\",\"\")","v":""},null,null,null,null,null,null,null,null,null,null,null,"Atsavināšana vai likvidācija pārskata gadā",null,null,null,null,null,null,null,null,null,null,null,null,null,null,null,null,null,null,null,null,null,null,null,null,null,null,null,null,null,"Summa",null,null,null,null,null,null,"Atsavināšana vai likvidācija pārskata gadā",null,null,null,null,null,null,null,null,null,null,null,null,null,null,null,null,null,null,null,null,null,null,null,null,null,null,null,null,null,"Summa"]
[null,3,{"$f":"IFERROR(IF(OR(AS632<>\"\",CD632<>\"\"),\"GS\",\"G\"),\"GS\")","v":"G"},null,null,null,null,null,"R30103_P2_R03",{"$f":"COLUMN(O632)","v":15},{"$f":"LEFT(IF(O632=\"\",AZ632,O632),LEN(IF(O632=\"\",AZ632,O632))/2)","v":""},null,null,null,null,null,null,null,null,null,null,null,null,null,null,null,null,null,null,null,null,null,null,null,null,null,null,null,null,null,null,null,null,null,null,null,null,null,null,null,null,null,null,null,null,null,null,null,null,null,null,null,null,null,null,null,null,null,null,null,null,null,null,null,null,null,null,null,null,null,null,null,null,null,null,null,"x"]
[null,3,{"$f":"C632","v":"G"},null,null,null,null,-1,"R30103_P2_R03Summa",{"$f":"\"L:\"&COLUMN(AS633)","v":"L:45"},{"$f":"RIGHT(IF(O632=\"\",AZ632,O632),LEN(IF(O632=\"\",AZ632,O632))/2)","v":""}]
[null,3,{"$f":"C635","v":""}]
[null,3,{"$f":"IF(C636=\"GS\",\"S\",\"\")","v":""},null,null,null,null,null,null,null,null,null,null,null,"Pārvietošana uz citu bilances posteni",null,null,null,null,null,null,null,null,null,null,null,null,null,null,null,null,null,null,null,null,null,null,null,null,null,null,null,null,null,"Summa",null,null,null,null,null,null,"Pārvietošana uz citu bilances posteni",null,null,null,null,null,null,null,null,null,null,null,null,null,null,null,null,null,null,null,null,null,null,null,null,null,null,null,null,null,"Summa"]
[null,3,{"$f":"IFERROR(IF(OR(AS636<>\"\",CD636<>\"\"),\"GS\",\"G\"),\"GS\")","v":"G"},null,null,null,null,null,"R30103_P2_R04",{"$f":"COLUMN(O636)","v":15},{"$f":"LEFT(IF(O636=\"\",AZ636,O636),LEN(IF(O636=\"\",AZ636,O636))/2)","v":""},null,null,null,null,null,null,null,null,null,null,null,null,null,null,null,null,null,null,null,null,null,null,null,null,null,null,null,null,null,null,null,null,null,null,null,null,null,null,null,null,null,null,null,null,null,null,null,null,null,null,null,null,null,null,null,null,null,null,null,null,null,null,null,null,null,null,null,null,null,null,null,null,null,null,null,"x"]
[null,3,{"$f":"C636","v":"G"},null,null,null,null,-1,"R30103_P2_R04Summa",{"$f":"\"L:\"&COLUMN(AS637)","v":"L:45"},{"$f":"RIGHT(IF(O636=\"\",AZ636,O636),LEN(IF(O636=\"\",AZ636,O636))/2)","v":""}]
[null,3]
[null,3,null,null,null,null,null,null,null,null,null,null,null,null,"Uzkrātās vērtības samazinājuma korekcijas:",null,null,null,null,null,null,null,null,null,null,null,null,null,null,null,null,null,null,null,null,null,null,null,null,null,null,null,null,null,"Summa",null,null,null,null,null,null,"Uzkrātās vērtības samazinājuma korekcijas:",null,null,null,null,null,null,null,null,null,null,null,null,null,null,null,null,null,null,null,null,null,null,null,null,null,null,null,null,null,"Summa"]
[null,3,{"$f":"IFERROR(IF(OR(COUNT(AS640:AU641)>0,COUNT(CD640:CF641)>0),\"GS\",\"G\"),\"GS\")","v":"G"},null,null,null,null,null,"R30103_P2_R0501",{"$f":"\"L:\"&COLUMN(AS640)","v":"L:45"},null,null,null,null,"pārskata gada sākumā",null,null,null,null,null,null,null,null,null,null,null,null,null,null,null,null,null,null,null,null,null,null,null,null,null,null,null,null,null,null,null,null,null,null,null,null,"pārskata gada sākumā"]
[null,3,{"$f":"C640","v":"G"},null,null,null,null,null,"R30103_P2_R0502",{"$f":"\"L:\"&COLUMN(AS641)","v":"L:45"},null,null,null,null,"pārskata gada beigās",null,null,null,null,null,null,null,null,null,null,null,null,null,null,null,null,null,null,null,null,null,null,null,null,null,null,null,null,null,null,null,null,null,null,null,null,"pārskata gada beigās"]
[null,3,{"$f":"C643","v":""}]
[null,3,{"$f":"IF(C644=\"GS\",\"S\",\"\")","v":""},null,null,null,null,null,null,null,null,null,null,null,"Pārskata gadā aprēķinātās vērtības samazinājuma korekcijas",null,null,null,null,null,null,null,null,null,null,null,null,null,null,null,null,null,null,null,null,null,null,null,null,null,null,null,null,null,"Summa",null,null,null,null,null,null,"Pārskata gadā aprēķinātās vērtības samazinājuma korekcijas",null,null,null,null,null,null,null,null,null,null,null,null,null,null,null,null,null,null,null,null,null,null,null,null,null,null,null,null,null,"Summa"]
[null,3,{"$f":"IFERROR(IF(OR(AS644<>\"\",CD644<>\"\"),\"GS\",\"G\"),\"GS\")","v":"G"},null,null,null,null,null,"R30103_P2_R06",{"$f":"COLUMN(O644)","v":15},{"$f":"LEFT(IF(O644=\"\",AZ644,O644),LEN(IF(O644=\"\",AZ644,O644))/2)","v":""},null,null,null,null,null,null,null,null,null,null,null,null,null,null,null,null,null,null,null,null,null,null,null,null,null,null,null,null,null,null,null,null,null,null,null,null,null,null,null,null,null,null,null,null,null,null,null,null,null,null,null,null,null,null,null,null,null,null,null,null,null,null,null,null,null,null,null,null,null,null,null,null,null,null,null,"x"]
[null,3,{"$f":"C644","v":"G"},null,null,null,null,-1,"R30103_P2_R06Summa",{"$f":"\"L:\"&COLUMN(AS645)","v":"L:45"},{"$f":"RIGHT(IF(O644=\"\",AZ644,O644),LEN(IF(O644=\"\",AZ644,O644))/2)","v":""}]
[null,3]
[null,3,null,null,null,null,null,null,"R30103_P2_R07",{"$f":"\"L:\"&COLUMN(AS647)","v":"L:45"},null,null,null,null,"Uzkrāto vērtības samazinājuma korekciju kopsummas izmaiņas saistībā ar objekta atsavināšanu, likvidāciju vai pārvietošanu uz citu posteni",null,null,null,null,null,null,null,null,null,null,null,null,null,null,null,null,null,null,null,null,null,null,null,null,null,null,null,null,null,null,null,null,null,null,null,null,"Uzkrāto vērtības samazinājuma korekciju kopsummas izmaiņas saistībā ar objekta atsavināšanu, likvidāciju vai pārvietošanu uz citu posteni"]
[null,3]
[null,3,null,null,null,null,null,null,null,null,null,null,null,null,"Bilances vērtība:",null,null,null,null,null,null,null,null,null,null,null,null,null,null,null,null,null,null,null,null,null,null,null,null,null,null,null,null,null,"Summa",null,null,null,null,null,null,"Bilances vērtība:",null,null,null,null,null,null,null,null,null,null,null,null,null,null,null,null,null,null,null,null,null,null,null,null,null,null,null,null,null,"Summa"]
[null,3,{"$f":"IFERROR(IF(OR(COUNT(AS650:AU651)>0,COUNT(CD650:CF651)>0),\"GS\",\"G\"),\"GS\")","v":"G"},null,null,null,null,null,"R30103_P2_R0701",{"$f":"\"L:\"&COLUMN(AS650)","v":"L:45"},null,null,null,null,"pārskata gada sākumā",null,null,null,null,null,null,null,null,null,null,null,null,null,null,null,null,null,null,null,null,null,null,null,null,null,null,null,null,null,null,null,null,null,null,null,null,"pārskata gada sākumā"]
[null,3,{"$f":"C650","v":"G"},null,null,null,null,null,"R30103_P2_R0702",{"$f":"\"L:\"&COLUMN(AS651)","v":"L:45"},null,null,null,null,"pārskata gada beigās",null,null,null,null,null,null,null,null,null,null,null,null,null,null,null,null,null,null,null,null,null,null,null,null,null,null,null,null,null,null,null,null,null,null,null,null,"pārskata gada beigās"]
[null,3,{"$f":"C653","v":""}]
[null,3,{"$f":"IF(C654=\"GS\",\"S\",\"\")","v":""},null,null,null,null,null,null,null,null,null,null,null,"Papildus sniegtā informācija, ja tāda ir",null,null,null,null,null,null,null,null,null,null,null,null,null,null,null,null,null,null,null,null,null,null,null,null,null,null,null,null,null,null,null,null,null,null,null,null,"Papildus sniegtā informācija, ja tāda ir"]
[null,3,{"$f":"IFERROR(IF(OR(O654<>\"\",AZ654<>\"\"),\"GS\",\"G\"),\"GS\")","v":"G"},null,null,null,null,null,"R30103_P2_R08",{"$f":"COLUMN(O654)","v":15},{"$f":"LEFT(IF(O654=\"\",AZ654,O654),LEN(IF(O654=\"\",AZ654,O654))/2)","v":""},null,null,null,null,null,null,null,null,null,null,null,null,null,null,null,null,null,null,null,null,null,null,null,null,null,null,null,null,null,null,null,null,null,null,null,null,null,null,null,null,null,null,null,null,null,null,null,null,null,null,null,null,null,null,null,null,null,null,null,null,null,null,null,null,null,null,null,null,null,null,null,null,null,null,null,"x"]
[null,3,{"$f":"C654","v":"G"},null,null,null,null,null,null,{"$f":"COLUMN(O655)","v":15},{"$f":"RIGHT(IF(O654=\"\",AZ654,O654),LEN(IF(O654=\"\",AZ654,O654))/2)","v":""}]
[null,3,{"$f":"C657","v":""}]
[null,3,{"$f":"C658","v":""},null,null,"x","x",null,null,null,null,null,null,"3.1.3.3.","Postenis3",null,null,null,null,null,null,null,null,null,null,null,null,null,null,null,null,null,null,null,null,null,null,null,null,null,null,null,null,null,null,null,null,null,null,null,"3.1.3.3.","Postenis3"]
[null,3,{"$f":"IF(C659=\"GS\",\"S\",\"\")","v":""},null,null,null,null,null,{"$f":"COUNTA(O659,AS663:AU664,O667:AU668,O671:AU672,O675:AU676,AS679:AU680,O683:AU684,AS686,AS689:AU690,O693)","v":0},null,null,null,null,null,"Norāde, par kādu bilances posteni tiks sniegta informācija",null,null,null,null,null,null,null,null,null,null,null,null,null,null,null,null,null,null,null,null,null,null,null,null,null,null,null,null,null,null,null,null,null,null,null,null,"Norāde, par kādu bilances posteni tiks sniegta informācija"]
[null,3,{"$f":"IFERROR(IF(OR(O659<>\"\",AZ659<>\"\"),\"GS\",\"G\"),\"GS\")","v":"G"},null,null,null,null,null,"R30103_P3_R00",{"$f":"COLUMN(O659)","v":15},{"$f":"LEFT(IF(O659=\"\",AZ659,O659),LEN(IF(O659=\"\",AZ659,O659))/2)","v":""},null,null,null,null,null,null,null,null,null,null,null,null,null,null,null,null,null,null,null,null,null,null,null,null,null,null,null,null,null,null,null,null,null,null,null,null,null,null,null,null,null,null,null,null,null,null,null,null,null,null,null,null,null,null,null,null,null,null,null,null,null,null,null,null,null,null,null,null,null,null,null,null,null,null,null,"x"]
[null,3,{"$f":"C659","v":"G"},null,null,null,null,null,null,{"$f":"COLUMN(O660)","v":15},{"$f":"RIGHT(IF(O659=\"\",AZ659,O659),LEN(IF(O659=\"\",AZ659,O659))/2)","v":""}]
[null,3]
[null,3,null,null,null,null,null,null,null,null,null,null,null,null,"Iegādes izmaksas vai ražošanas pašizmaksa:",null,null,null,null,null,null,null,null,null,null,null,null,null,null,null,null,null,null,null,null,null,null,null,null,null,null,null,null,null,"Summa",null,null,null,null,null,null,"Iegādes izmaksas vai ražošanas pašizmaksa:",null,null,null,null,null,null,null,null,null,null,null,null,null,null,null,null,null,null,null,null,null,null,null,null,null,null,null,null,null,"Summa"]
[null,3,{"$f":"IFERROR(IF(OR(COUNT(AS663:AU664)>0,COUNT(CD663:CF664)>0),\"GS\",\"G\"),\"GS\")","v":"G"},null,null,null,null,null,"R30103_P3_R0101",{"$f":"\"L:\"&COLUMN(AS663)","v":"L:45"},null,null,null,null,"pārskata gada sākumā",null,null,null,null,null,null,null,null,null,null,null,null,null,null,null,null,null,null,null,null,null,null,null,null,null,null,null,null,null,null,null,null,null,null,null,null,"pārskata gada sākumā"]
[null,3,{"$f":"C663","v":"G"},null,null,null,null,null,"R30103_P3_R0102",{"$f":"\"L:\"&COLUMN(AS664)","v":"L:45"},null,null,null,null,"pārskata gada beigās",null,null,null,null,null,null,null,null,null,null,null,null,null,null,null,null,null,null,null,null,null,null,null,null,null,null,null,null,null,null,null,null,null,null,null,null,"pārskata gada beigās"]
[null,3,{"$f":"C666","v":""}]
[null,3,{"$f":"IF(C667=\"GS\",\"S\",\"\")","v":""},null,null,null,null,null,null,null,null,null,null,null,"Vērtības palielinājumi, ieskaitot uzlabojumus",null,null,null,null,null,null,null,null,null,null,null,null,null,null,null,null,null,null,null,null,null,null,null,null,null,null,null,null,null,"Summa",null,null,null,null,null,null,"Vērtības palielinājumi, ieskaitot uzlabojumus",null,null,null,null,null,null,null,null,null,null,null,null,null,null,null,null,null,null,null,null,null,null,null,null,null,null,null,null,null,"Summa"]
[null,3,{"$f":"IFERROR(IF(OR(AS667<>\"\",CD667<>\"\"),\"GS\",\"G\"),\"GS\")","v":"G"},null,null,null,null,null,"R30103_P3_R02",{"$f":"COLUMN(O667)","v":15},{"$f":"LEFT(IF(O667=\"\",AZ667,O667),LEN(IF(O667=\"\",AZ667,O667))/2)","v":""},null,null,null,null,null,null,null,null,null,null,null,null,null,null,null,null,null,null,null,null,null,null,null,null,null,null,null,null,null,null,null,null,null,null,null,null,null,null,null,null,null,null,null,null,null,null,null,null,null,null,null,null,null,null,null,null,null,null,null,null,null,null,null,null,null,null,null,null,null,null,null,null,null,null,null,"x"]
[null,3,{"$f":"C667","v":"G"},null,null,null,null,-1,"R30103_P3_R02Summa",{"$f":"\"L:\"&COLUMN(AS668)","v":"L:45"},{"$f":"RIGHT(IF(O667=\"\",AZ667,O667),LEN(IF(O667=\"\",AZ667,O667))/2)","v":""}]
[null,3,{"$f":"C670","v":""}]
[null,3,{"$f":"IF(C671=\"GS\",\"S\",\"\")","v":""},null,null,null,null,null,null,null,null,null,null,null,"Atsavināšana vai likvidācija pārskata gadā",null,null,null,null,null,null,null,null,null,null,null,null,null,null,null,null,null,null,null,null,null,null,null,null,null,null,null,null,null,"Summa",null,null,null,null,null,null,"Atsavināšana vai likvidācija pārskata gadā",null,null,null,null,null,null,null,null,null,null,null,null,null,null,null,null,null,null,null,null,null,null,null,null,null,null,null,null,null,"Summa"]
[null,3,{"$f":"IFERROR(IF(OR(AS671<>\"\",CD671<>\"\"),\"GS\",\"G\"),\"GS\")","v":"G"},null,null,null,null,null,"R30103_P3_R03",{"$f":"COLUMN(O671)","v":15},{"$f":"LEFT(IF(O671=\"\",AZ671,O671),LEN(IF(O671=\"\",AZ671,O671))/2)","v":""},null,null,null,null,null,null,null,null,null,null,null,null,null,null,null,null,null,null,null,null,null,null,null,null,null,null,null,null,null,null,null,null,null,null,null,null,null,null,null,null,null,null,null,null,null,null,null,null,null,null,null,null,null,null,null,null,null,null,null,null,null,null,null,null,null,null,null,null,null,null,null,null,null,null,null,"x"]
[null,3,{"$f":"C671","v":"G"},null,null,null,null,-1,"R30103_P3_R03Summa",{"$f":"\"L:\"&COLUMN(AS672)","v":"L:45"},{"$f":"RIGHT(IF(O671=\"\",AZ671,O671),LEN(IF(O671=\"\",AZ671,O671))/2)","v":""}]
[null,3,{"$f":"C674","v":""}]
[null,3,{"$f":"IF(C675=\"GS\",\"S\",\"\")","v":""},null,null,null,null,null,null,null,null,null,null,null,"Pārvietošana uz citu bilances posteni",null,null,null,null,null,null,null,null,null,null,null,null,null,null,null,null,null,null,null,null,null,null,null,null,null,null,null,null,null,"Summa",null,null,null,null,null,null,"Pārvietošana uz citu bilances posteni",null,null,null,null,null,null,null,null,null,null,null,null,null,null,null,null,null,null,null,null,null,null,null,null,null,null,null,null,null,"Summa"]
[null,3,{"$f":"IFERROR(IF(OR(AS675<>\"\",CD675<>\"\"),\"GS\",\"G\"),\"GS\")","v":"G"},null,null,null,null,null,"R30103_P3_R04",{"$f":"COLUMN(O675)","v":15},{"$f":"LEFT(IF(O675=\"\",AZ675,O675),LEN(IF(O675=\"\",AZ675,O675))/2)","v":""},null,null,null,null,null,null,null,null,null,null,null,null,null,null,null,null,null,null,null,null,null,null,null,null,null,null,null,null,null,null,null,null,null,null,null,null,null,null,null,null,null,null,null,null,null,null,null,null,null,null,null,null,null,null,null,null,null,null,null,null,null,null,null,null,null,null,null,null,null,null,null,null,null,null,null,"x"]
[null,3,{"$f":"C675","v":"G"},null,null,null,null,-1,"R30103_P3_R04Summa",{"$f":"\"L:\"&COLUMN(AS676)","v":"L:45"},{"$f":"RIGHT(IF(O675=\"\",AZ675,O675),LEN(IF(O675=\"\",AZ675,O675))/2)","v":""}]
[null,3]
[null,3,null,null,null,null,null,null,null,null,null,null,null,null,"Uzkrātās vērtības samazinājuma korekcijas:",null,null,null,null,null,null,null,null,null,null,null,null,null,null,null,null,null,null,null,null,null,null,null,null,null,null,null,null,null,"Summa",null,null,null,null,null,null,"Uzkrātās vērtības samazinājuma korekcijas:",null,null,null,null,null,null,null,null,null,null,null,null,null,null,null,null,null,null,null,null,null,null,null,null,null,null,null,null,null,"Summa"]
[null,3,{"$f":"IFERROR(IF(OR(COUNT(AS679:AU680)>0,COUNT(CD679:CF680)>0),\"GS\",\"G\"),\"GS\")","v":"G"},null,null,null,null,null,"R30103_P3_R0501",{"$f":"\"L:\"&COLUMN(AS679)","v":"L:45"},null,null,null,null,"pārskata gada sākumā",null,null,null,null,null,null,null,null,null,null,null,null,null,null,null,null,null,null,null,null,null,null,null,null,null,null,null,null,null,null,null,null,null,null,null,null,"pārskata gada sākumā"]
[null,3,{"$f":"C679","v":"G"},null,null,null,null,null,"R30103_P3_R0502",{"$f":"\"L:\"&COLUMN(AS680)","v":"L:45"},null,null,null,null,"pārskata gada beigās",null,null,null,null,null,null,null,null,null,null,null,null,null,null,null,null,null,null,null,null,null,null,null,null,null,null,null,null,null,null,null,null,null,null,null,null,"pārskata gada beigās"]
[null,3,{"$f":"C682","v":""}]
[null,3,{"$f":"IF(C683=\"GS\",\"S\",\"\")","v":""},null,null,null,null,null,null,null,null,null,null,null,"Pārskata gadā aprēķinātās vērtības samazinājuma korekcijas",null,null,null,null,null,null,null,null,null,null,null,null,null,null,null,null,null,null,null,null,null,null,null,null,null,null,null,null,null,"Summa",null,null,null,null,null,null,"Pārskata gadā aprēķinātās vērtības samazinājuma korekcijas",null,null,null,null,null,null,null,null,null,null,null,null,null,null,null,null,null,null,null,null,null,null,null,null,null,null,null,null,null,"Summa"]
[null,3,{"$f":"IFERROR(IF(OR(AS683<>\"\",CD683<>\"\"),\"GS\",\"G\"),\"GS\")","v":"G"},null,null,null,null,null,"R30103_P3_R06",{"$f":"COLUMN(O683)","v":15},{"$f":"LEFT(IF(O683=\"\",AZ683,O683),LEN(IF(O683=\"\",AZ683,O683))/2)","v":""},null,null,null,null,null,null,null,null,null,null,null,null,null,null,null,null,null,null,null,null,null,null,null,null,null,null,null,null,null,null,null,null,null,null,null,null,null,null,null,null,null,null,null,null,null,null,null,null,null,null,null,null,null,null,null,null,null,null,null,null,null,null,null,null,null,null,null,null,null,null,null,null,null,null,null,"x"]
[null,3,{"$f":"C683","v":"G"},null,null,null,null,-1,"R30103_P3_R06Summa",{"$f":"\"L:\"&COLUMN(AS684)","v":"L:45"},{"$f":"RIGHT(IF(O683=\"\",AZ683,O683),LEN(IF(O683=\"\",AZ683,O683))/2)","v":""}]
[null,3]
[null,3,null,null,null,null,null,null,"R30103_P3_R07",{"$f":"\"L:\"&COLUMN(AS686)","v":"L:45"},null,null,null,null,"Uzkrāto vērtības samazinājuma korekciju kopsummas izmaiņas saistībā ar objekta atsavināšanu, likvidāciju vai pārvietošanu uz citu posteni",null,null,null,null,null,null,null,null,null,null,null,null,null,null,null,null,null,null,null,null,null,null,null,null,null,null,null,null,null,null,null,null,null,null,null,null,"Uzkrāto vērtības samazinājuma korekciju kopsummas izmaiņas saistībā ar objekta atsavināšanu, likvidāciju vai pārvietošanu uz citu posteni"]
[null,3]
[null,3,null,null,null,null,null,null,null,null,null,null,null,null,"Bilances vērtība:",null,null,null,null,null,null,null,null,null,null,null,null,null,null,null,null,null,null,null,null,null,null,null,null,null,null,null,null,null,"Summa",null,null,null,null,null,null,"Bilances vērtība:",null,null,null,null,null,null,null,null,null,null,null,null,null,null,null,null,null,null,null,null,null,null,null,null,null,null,null,null,null,"Summa"]
[null,3,{"$f":"IFERROR(IF(OR(COUNT(AS689:AU690)>0,COUNT(CD689:CF690)>0),\"GS\",\"G\"),\"GS\")","v":"G"},null,null,null,null,null,"R30103_P3_R0701",{"$f":"\"L:\"&COLUMN(AS689)","v":"L:45"},null,null,null,null,"pārskata gada sākumā",null,null,null,null,null,null,null,null,null,null,null,null,null,null,null,null,null,null,null,null,null,null,null,null,null,null,null,null,null,null,null,null,null,null,null,null,"pārskata gada sākumā"]
[null,3,{"$f":"C689","v":"G"},null,null,null,null,null,"R30103_P3_R0702",{"$f":"\"L:\"&COLUMN(AS690)","v":"L:45"},null,null,null,null,"pārskata gada beigās",null,null,null,null,null,null,null,null,null,null,null,null,null,null,null,null,null,null,null,null,null,null,null,null,null,null,null,null,null,null,null,null,null,null,null,null,"pārskata gada beigās"]
[null,3,{"$f":"C692","v":""}]
[null,3,{"$f":"IF(C693=\"GS\",\"S\",\"\")","v":""},null,null,null,null,null,null,null,null,null,null,null,"Papildus sniegtā informācija, ja tāda ir",null,null,null,null,null,null,null,null,null,null,null,null,null,null,null,null,null,null,null,null,null,null,null,null,null,null,null,null,null,null,null,null,null,null,null,null,"Papildus sniegtā informācija, ja tāda ir"]
[null,3,{"$f":"IFERROR(IF(OR(O693<>\"\",AZ693<>\"\"),\"GS\",\"G\"),\"GS\")","v":"G"},null,null,null,null,null,"R30103_P3_R08",{"$f":"COLUMN(O693)","v":15},{"$f":"LEFT(IF(O693=\"\",AZ693,O693),LEN(IF(O693=\"\",AZ693,O693))/2)","v":""},null,null,null,null,null,null,null,null,null,null,null,null,null,null,null,null,null,null,null,null,null,null,null,null,null,null,null,null,null,null,null,null,null,null,null,null,null,null,null,null,null,null,null,null,null,null,null,null,null,null,null,null,null,null,null,null,null,null,null,null,null,null,null,null,null,null,null,null,null,null,null,null,null,null,null,"x"]
[null,3,{"$f":"C693","v":"G"},null,null,null,null,null,null,{"$f":"COLUMN(O694)","v":15},{"$f":"RIGHT(IF(O693=\"\",AZ693,O693),LEN(IF(O693=\"\",AZ693,O693))/2)","v":""}]
[null,3,{"$f":"C696","v":""}]
[null,3,{"$f":"C697","v":""},null,null,"x","x",null,null,null,null,null,null,"3.1.3.4.","Postenis4",null,null,null,null,null,null,null,null,null,null,null,null,null,null,null,null,null,null,null,null,null,null,null,null,null,null,null,null,null,null,null,null,null,null,null,"3.1.3.4.","Postenis4"]
[null,3,{"$f":"IF(C698=\"GS\",\"S\",\"\")","v":""},null,null,null,null,null,{"$f":"COUNTA(O698,AS702:AU703,O706:AU707,O710:AU711,O714:AU715,AS718:AU719,O722:AU723,AS725,AS728:AU729,O732)","v":0},null,null,null,null,null,"Norāde, par kādu bilances posteni tiks sniegta informācija",null,null,null,null,null,null,null,null,null,null,null,null,null,null,null,null,null,null,null,null,null,null,null,null,null,null,null,null,null,null,null,null,null,null,null,null,"Norāde, par kādu bilances posteni tiks sniegta informācija"]
[null,3,{"$f":"IFERROR(IF(OR(O698<>\"\",AZ698<>\"\"),\"GS\",\"G\"),\"GS\")","v":"G"},null,null,null,null,null,"R30103_P4_R00",{"$f":"COLUMN(O698)","v":15},{"$f":"LEFT(IF(O698=\"\",AZ698,O698),LEN(IF(O698=\"\",AZ698,O698))/2)","v":""},null,null,null,null,null,null,null,null,null,null,null,null,null,null,null,null,null,null,null,null,null,null,null,null,null,null,null,null,null,null,null,null,null,null,null,null,null,null,null,null,null,null,null,null,null,null,null,null,null,null,null,null,null,null,null,null,null,null,null,null,null,null,null,null,null,null,null,null,null,null,null,null,null,null,null,"x"]
[null,3,{"$f":"C698","v":"G"},null,null,null,null,null,null,{"$f":"COLUMN(O699)","v":15},{"$f":"RIGHT(IF(O698=\"\",AZ698,O698),LEN(IF(O698=\"\",AZ698,O698))/2)","v":""}]
[null,3]
[null,3,null,null,null,null,null,null,null,null,null,null,null,null,"Iegādes izmaksas vai ražošanas pašizmaksa:",null,null,null,null,null,null,null,null,null,null,null,null,null,null,null,null,null,null,null,null,null,null,null,null,null,null,null,null,null,"Summa",null,null,null,null,null,null,"Iegādes izmaksas vai ražošanas pašizmaksa:",null,null,null,null,null,null,null,null,null,null,null,null,null,null,null,null,null,null,null,null,null,null,null,null,null,null,null,null,null,"Summa"]
[null,3,{"$f":"IFERROR(IF(OR(COUNT(AS702:AU703)>0,COUNT(CD702:CF703)>0),\"GS\",\"G\"),\"GS\")","v":"G"},null,null,null,null,null,"R30103_P4_R0101",{"$f":"\"L:\"&COLUMN(AS702)","v":"L:45"},null,null,null,null,"pārskata gada sākumā",null,null,null,null,null,null,null,null,null,null,null,null,null,null,null,null,null,null,null,null,null,null,null,null,null,null,null,null,null,null,null,null,null,null,null,null,"pārskata gada sākumā"]
[null,3,{"$f":"C702","v":"G"},null,null,null,null,null,"R30103_P4_R0102",{"$f":"\"L:\"&COLUMN(AS703)","v":"L:45"},null,null,null,null,"pārskata gada beigās",null,null,null,null,null,null,null,null,null,null,null,null,null,null,null,null,null,null,null,null,null,null,null,null,null,null,null,null,null,null,null,null,null,null,null,null,"pārskata gada beigās"]
[null,3,{"$f":"C705","v":""}]
[null,3,{"$f":"IF(C706=\"GS\",\"S\",\"\")","v":""},null,null,null,null,null,null,null,null,null,null,null,"Vērtības palielinājumi, ieskaitot uzlabojumus",null,null,null,null,null,null,null,null,null,null,null,null,null,null,null,null,null,null,null,null,null,null,null,null,null,null,null,null,null,"Summa",null,null,null,null,null,null,"Vērtības palielinājumi, ieskaitot uzlabojumus",null,null,null,null,null,null,null,null,null,null,null,null,null,null,null,null,null,null,null,null,null,null,null,null,null,null,null,null,null,"Summa"]
[null,3,{"$f":"IFERROR(IF(OR(AS706<>\"\",CD706<>\"\"),\"GS\",\"G\"),\"GS\")","v":"G"},null,null,null,null,null,"R30103_P4_R02",{"$f":"COLUMN(O706)","v":15},{"$f":"LEFT(IF(O706=\"\",AZ706,O706),LEN(IF(O706=\"\",AZ706,O706))/2)","v":""},null,null,null,null,null,null,null,null,null,null,null,null,null,null,null,null,null,null,null,null,null,null,null,null,null,null,null,null,null,null,null,null,null,null,null,null,null,null,null,null,null,null,null,null,null,null,null,null,null,null,null,null,null,null,null,null,null,null,null,null,null,null,null,null,null,null,null,null,null,null,null,null,null,null,null,"x"]
[null,3,{"$f":"C706","v":"G"},null,null,null,null,-1,"R30103_P4_R02Summa",{"$f":"\"L:\"&COLUMN(AS707)","v":"L:45"},{"$f":"RIGHT(IF(O706=\"\",AZ706,O706),LEN(IF(O706=\"\",AZ706,O706))/2)","v":""}]
[null,3,{"$f":"C709","v":""}]
[null,3,{"$f":"IF(C710=\"GS\",\"S\",\"\")","v":""},null,null,null,null,null,null,null,null,null,null,null,"Atsavināšana vai likvidācija pārskata gadā",null,null,null,null,null,null,null,null,null,null,null,null,null,null,null,null,null,null,null,null,null,null,null,null,null,null,null,null,null,"Summa",null,null,null,null,null,null,"Atsavināšana vai likvidācija pārskata gadā",null,null,null,null,null,null,null,null,null,null,null,null,null,null,null,null,null,null,null,null,null,null,null,null,null,null,null,null,null,"Summa"]
[null,3,{"$f":"IFERROR(IF(OR(AS710<>\"\",CD710<>\"\"),\"GS\",\"G\"),\"GS\")","v":"G"},null,null,null,null,null,"R30103_P4_R03",{"$f":"COLUMN(O710)","v":15},{"$f":"LEFT(IF(O710=\"\",AZ710,O710),LEN(IF(O710=\"\",AZ710,O710))/2)","v":""},null,null,null,null,null,null,null,null,null,null,null,null,null,null,null,null,null,null,null,null,null,null,null,null,null,null,null,null,null,null,null,null,null,null,null,null,null,null,null,null,null,null,null,null,null,null,null,null,null,null,null,null,null,null,null,null,null,null,null,null,null,null,null,null,null,null,null,null,null,null,null,null,null,null,null,"x"]
[null,3,{"$f":"C710","v":"G"},null,null,null,null,-1,"R30103_P4_R03Summa",{"$f":"\"L:\"&COLUMN(AS711)","v":"L:45"},{"$f":"RIGHT(IF(O710=\"\",AZ710,O710),LEN(IF(O710=\"\",AZ710,O710))/2)","v":""}]
[null,3,{"$f":"C713","v":""}]
[null,3,{"$f":"IF(C714=\"GS\",\"S\",\"\")","v":""},null,null,null,null,null,null,null,null,null,null,null,"Pārvietošana uz citu bilances posteni",null,null,null,null,null,null,null,null,null,null,null,null,null,null,null,null,null,null,null,null,null,null,null,null,null,null,null,null,null,"Summa",null,null,null,null,null,null,"Pārvietošana uz citu bilances posteni",null,null,null,null,null,null,null,null,null,null,null,null,null,null,null,null,null,null,null,null,null,null,null,null,null,null,null,null,null,"Summa"]
[null,3,{"$f":"IFERROR(IF(OR(AS714<>\"\",CD714<>\"\"),\"GS\",\"G\"),\"GS\")","v":"G"},null,null,null,null,null,"R30103_P4_R04",{"$f":"COLUMN(O714)","v":15},{"$f":"LEFT(IF(O714=\"\",AZ714,O714),LEN(IF(O714=\"\",AZ714,O714))/2)","v":""},null,null,null,null,null,null,null,null,null,null,null,null,null,null,null,null,null,null,null,null,null,null,null,null,null,null,null,null,null,null,null,null,null,null,null,null,null,null,null,null,null,null,null,null,null,null,null,null,null,null,null,null,null,null,null,null,null,null,null,null,null,null,null,null,null,null,null,null,null,null,null,null,null,null,null,"x"]
[null,3,{"$f":"C714","v":"G"},null,null,null,null,-1,"R30103_P4_R04Summa",{"$f":"\"L:\"&COLUMN(AS715)","v":"L:45"},{"$f":"RIGHT(IF(O714=\"\",AZ714,O714),LEN(IF(O714=\"\",AZ714,O714))/2)","v":""}]
[null,3]
[null,3,null,null,null,null,null,null,null,null,null,null,null,null,"Uzkrātās vērtības samazinājuma korekcijas:",null,null,null,null,null,null,null,null,null,null,null,null,null,null,null,null,null,null,null,null,null,null,null,null,null,null,null,null,null,"Summa",null,null,null,null,null,null,"Uzkrātās vērtības samazinājuma korekcijas:",null,null,null,null,null,null,null,null,null,null,null,null,null,null,null,null,null,null,null,null,null,null,null,null,null,null,null,null,null,"Summa"]
[null,3,{"$f":"IFERROR(IF(OR(COUNT(AS718:AU719)>0,COUNT(CD718:CF719)>0),\"GS\",\"G\"),\"GS\")","v":"G"},null,null,null,null,null,"R30103_P4_R0501",{"$f":"\"L:\"&COLUMN(AS718)","v":"L:45"},null,null,null,null,"pārskata gada sākumā",null,null,null,null,null,null,null,null,null,null,null,null,null,null,null,null,null,null,null,null,null,null,null,null,null,null,null,null,null,null,null,null,null,null,null,null,"pārskata gada sākumā"]
[null,3,{"$f":"C718","v":"G"},null,null,null,null,null,"R30103_P4_R0502",{"$f":"\"L:\"&COLUMN(AS719)","v":"L:45"},null,null,null,null,"pārskata gada beigās",null,null,null,null,null,null,null,null,null,null,null,null,null,null,null,null,null,null,null,null,null,null,null,null,null,null,null,null,null,null,null,null,null,null,null,null,"pārskata gada beigās"]
[null,3,{"$f":"C721","v":""}]
[null,3,{"$f":"IF(C722=\"GS\",\"S\",\"\")","v":""},null,null,null,null,null,null,null,null,null,null,null,"Pārskata gadā aprēķinātās vērtības samazinājuma korekcijas",null,null,null,null,null,null,null,null,null,null,null,null,null,null,null,null,null,null,null,null,null,null,null,null,null,null,null,null,null,"Summa",null,null,null,null,null,null,"Pārskata gadā aprēķinātās vērtības samazinājuma korekcijas",null,null,null,null,null,null,null,null,null,null,null,null,null,null,null,null,null,null,null,null,null,null,null,null,null,null,null,null,null,"Summa"]
[null,3,{"$f":"IFERROR(IF(OR(AS722<>\"\",CD722<>\"\"),\"GS\",\"G\"),\"GS\")","v":"G"},null,null,null,null,null,"R30103_P4_R06",{"$f":"COLUMN(O722)","v":15},{"$f":"LEFT(IF(O722=\"\",AZ722,O722),LEN(IF(O722=\"\",AZ722,O722))/2)","v":""},null,null,null,null,null,null,null,null,null,null,null,null,null,null,null,null,null,null,null,null,null,null,null,null,null,null,null,null,null,null,null,null,null,null,null,null,null,null,null,null,null,null,null,null,null,null,null,null,null,null,null,null,null,null,null,null,null,null,null,null,null,null,null,null,null,null,null,null,null,null,null,null,null,null,null,"x"]
[null,3,{"$f":"C722","v":"G"},null,null,null,null,-1,"R30103_P4_R06Summa",{"$f":"\"L:\"&COLUMN(AS723)","v":"L:45"},{"$f":"RIGHT(IF(O722=\"\",AZ722,O722),LEN(IF(O722=\"\",AZ722,O722))/2)","v":""}]
[null,3]
[null,3,null,null,null,null,null,null,"R30103_P4_R07",{"$f":"\"L:\"&COLUMN(AS725)","v":"L:45"},null,null,null,null,"Uzkrāto vērtības samazinājuma korekciju kopsummas izmaiņas saistībā ar objekta atsavināšanu, likvidāciju vai pārvietošanu uz citu posteni",null,null,null,null,null,null,null,null,null,null,null,null,null,null,null,null,null,null,null,null,null,null,null,null,null,null,null,null,null,null,null,null,null,null,null,null,"Uzkrāto vērtības samazinājuma korekciju kopsummas izmaiņas saistībā ar objekta atsavināšanu, likvidāciju vai pārvietošanu uz citu posteni"]
[null,3]
[null,3,null,null,null,null,null,null,null,null,null,null,null,null,"Bilances vērtība:",null,null,null,null,null,null,null,null,null,null,null,null,null,null,null,null,null,null,null,null,null,null,null,null,null,null,null,null,null,"Summa",null,null,null,null,null,null,"Bilances vērtība:",null,null,null,null,null,null,null,null,null,null,null,null,null,null,null,null,null,null,null,null,null,null,null,null,null,null,null,null,null,"Summa"]
[null,3,{"$f":"IFERROR(IF(OR(COUNT(AS728:AU729)>0,COUNT(CD728:CF729)>0),\"GS\",\"G\"),\"GS\")","v":"G"},null,null,null,null,null,"R30103_P4_R0701",{"$f":"\"L:\"&COLUMN(AS728)","v":"L:45"},null,null,null,null,"pārskata gada sākumā",null,null,null,null,null,null,null,null,null,null,null,null,null,null,null,null,null,null,null,null,null,null,null,null,null,null,null,null,null,null,null,null,null,null,null,null,"pārskata gada sākumā"]
[null,3,{"$f":"C728","v":"G"},null,null,null,null,null,"R30103_P4_R0702",{"$f":"\"L:\"&COLUMN(AS729)","v":"L:45"},null,null,null,null,"pārskata gada beigās",null,null,null,null,null,null,null,null,null,null,null,null,null,null,null,null,null,null,null,null,null,null,null,null,null,null,null,null,null,null,null,null,null,null,null,null,"pārskata gada beigās"]
[null,3,{"$f":"C731","v":""}]
[null,3,{"$f":"IF(C732=\"GS\",\"S\",\"\")","v":""},null,null,null,null,null,null,null,null,null,null,null,"Papildus sniegtā informācija, ja tāda ir",null,null,null,null,null,null,null,null,null,null,null,null,null,null,null,null,null,null,null,null,null,null,null,null,null,null,null,null,null,null,null,null,null,null,null,null,"Papildus sniegtā informācija, ja tāda ir"]
[null,3,{"$f":"IFERROR(IF(OR(O732<>\"\",AZ732<>\"\"),\"GS\",\"G\"),\"GS\")","v":"G"},null,null,null,null,null,"R30103_P4_R08",{"$f":"COLUMN(O732)","v":15},{"$f":"LEFT(IF(O732=\"\",AZ732,O732),LEN(IF(O732=\"\",AZ732,O732))/2)","v":""},null,null,null,null,null,null,null,null,null,null,null,null,null,null,null,null,null,null,null,null,null,null,null,null,null,null,null,null,null,null,null,null,null,null,null,null,null,null,null,null,null,null,null,null,null,null,null,null,null,null,null,null,null,null,null,null,null,null,null,null,null,null,null,null,null,null,null,null,null,null,null,null,null,null,null,"x"]
[null,3,{"$f":"C732","v":"G"},null,null,null,null,null,null,{"$f":"COLUMN(O733)","v":15},{"$f":"RIGHT(IF(O732=\"\",AZ732,O732),LEN(IF(O732=\"\",AZ732,O732))/2)","v":""}]
[null,3,{"$f":"C735","v":""}]
[null,3,{"$f":"C736","v":""},null,null,"x","x",null,null,null,null,null,null,"3.1.3.5.","Postenis5",null,null,null,null,null,null,null,null,null,null,null,null,null,null,null,null,null,null,null,null,null,null,null,null,null,null,null,null,null,null,null,null,null,null,null,"3.1.3.5.","Postenis5"]
[null,3,{"$f":"IF(C737=\"GS\",\"S\",\"\")","v":""},null,null,null,null,null,{"$f":"COUNTA(O737,AS741:AU742,O745:AU746,O749:AU750,O753:AU754,AS757:AU758,O761:AU762,AS764,AS767:AU768,O771)","v":0},null,null,null,null,null,"Norāde, par kādu bilances posteni tiks sniegta informācija",null,null,null,null,null,null,null,null,null,null,null,null,null,null,null,null,null,null,null,null,null,null,null,null,null,null,null,null,null,null,null,null,null,null,null,null,"Norāde, par kādu bilances posteni tiks sniegta informācija"]
[null,3,{"$f":"IFERROR(IF(OR(O737<>\"\",AZ737<>\"\"),\"GS\",\"G\"),\"GS\")","v":"G"},null,null,null,null,null,"R30103_P5_R00",{"$f":"COLUMN(O737)","v":15},{"$f":"LEFT(IF(O737=\"\",AZ737,O737),LEN(IF(O737=\"\",AZ737,O737))/2)","v":""},null,null,null,null,null,null,null,null,null,null,null,null,null,null,null,null,null,null,null,null,null,null,null,null,null,null,null,null,null,null,null,null,null,null,null,null,null,null,null,null,null,null,null,null,null,null,null,null,null,null,null,null,null,null,null,null,null,null,null,null,null,null,null,null,null,null,null,null,null,null,null,null,null,null,null,"x"]
[null,3,{"$f":"C737","v":"G"},null,null,null,null,null,null,{"$f":"COLUMN(O738)","v":15},{"$f":"RIGHT(IF(O737=\"\",AZ737,O737),LEN(IF(O737=\"\",AZ737,O737))/2)","v":""}]
[null,3]
[null,3,null,null,null,null,null,null,null,null,null,null,null,null,"Iegādes izmaksas vai ražošanas pašizmaksa:",null,null,null,null,null,null,null,null,null,null,null,null,null,null,null,null,null,null,null,null,null,null,null,null,null,null,null,null,null,"Summa",null,null,null,null,null,null,"Iegādes izmaksas vai ražošanas pašizmaksa:",null,null,null,null,null,null,null,null,null,null,null,null,null,null,null,null,null,null,null,null,null,null,null,null,null,null,null,null,null,"Summa"]
[null,3,{"$f":"IFERROR(IF(OR(COUNT(AS741:AU742)>0,COUNT(CD741:CF742)>0),\"GS\",\"G\"),\"GS\")","v":"G"},null,null,null,null,null,"R30103_P5_R0101",{"$f":"\"L:\"&COLUMN(AS741)","v":"L:45"},null,null,null,null,"pārskata gada sākumā",null,null,null,null,null,null,null,null,null,null,null,null,null,null,null,null,null,null,null,null,null,null,null,null,null,null,null,null,null,null,null,null,null,null,null,null,"pārskata gada sākumā"]
[null,3,{"$f":"C741","v":"G"},null,null,null,null,null,"R30103_P5_R0102",{"$f":"\"L:\"&COLUMN(AS742)","v":"L:45"},null,null,null,null,"pārskata gada beigās",null,null,null,null,null,null,null,null,null,null,null,null,null,null,null,null,null,null,null,null,null,null,null,null,null,null,null,null,null,null,null,null,null,null,null,null,"pārskata gada beigās"]
[null,3,{"$f":"C744","v":""}]
[null,3,{"$f":"IF(C745=\"GS\",\"S\",\"\")","v":""},null,null,null,null,null,null,null,null,null,null,null,"Vērtības palielinājumi, ieskaitot uzlabojumus",null,null,null,null,null,null,null,null,null,null,null,null,null,null,null,null,null,null,null,null,null,null,null,null,null,null,null,null,null,"Summa",null,null,null,null,null,null,"Vērtības palielinājumi, ieskaitot uzlabojumus",null,null,null,null,null,null,null,null,null,null,null,null,null,null,null,null,null,null,null,null,null,null,null,null,null,null,null,null,null,"Summa"]
[null,3,{"$f":"IFERROR(IF(OR(AS745<>\"\",CD745<>\"\"),\"GS\",\"G\"),\"GS\")","v":"G"},null,null,null,null,null,"R30103_P5_R02",{"$f":"COLUMN(O745)","v":15},{"$f":"LEFT(IF(O745=\"\",AZ745,O745),LEN(IF(O745=\"\",AZ745,O745))/2)","v":""},null,null,null,null,null,null,null,null,null,null,null,null,null,null,null,null,null,null,null,null,null,null,null,null,null,null,null,null,null,null,null,null,null,null,null,null,null,null,null,null,null,null,null,null,null,null,null,null,null,null,null,null,null,null,null,null,null,null,null,null,null,null,null,null,null,null,null,null,null,null,null,null,null,null,null,"x"]
[null,3,{"$f":"C745","v":"G"},null,null,null,null,-1,"R30103_P5_R02Summa",{"$f":"\"L:\"&COLUMN(AS746)","v":"L:45"},{"$f":"RIGHT(IF(O745=\"\",AZ745,O745),LEN(IF(O745=\"\",AZ745,O745))/2)","v":""}]
[null,3,{"$f":"C748","v":""}]
[null,3,{"$f":"IF(C749=\"GS\",\"S\",\"\")","v":""},null,null,null,null,null,null,null,null,null,null,null,"Atsavināšana vai likvidācija pārskata gadā",null,null,null,null,null,null,null,null,null,null,null,null,null,null,null,null,null,null,null,null,null,null,null,null,null,null,null,null,null,"Summa",null,null,null,null,null,null,"Atsavināšana vai likvidācija pārskata gadā",null,null,null,null,null,null,null,null,null,null,null,null,null,null,null,null,null,null,null,null,null,null,null,null,null,null,null,null,null,"Summa"]
[null,3,{"$f":"IFERROR(IF(OR(AS749<>\"\",CD749<>\"\"),\"GS\",\"G\"),\"GS\")","v":"G"},null,null,null,null,null,"R30103_P5_R03",{"$f":"COLUMN(O749)","v":15},{"$f":"LEFT(IF(O749=\"\",AZ749,O749),LEN(IF(O749=\"\",AZ749,O749))/2)","v":""},null,null,null,null,null,null,null,null,null,null,null,null,null,null,null,null,null,null,null,null,null,null,null,null,null,null,null,null,null,null,null,null,null,null,null,null,null,null,null,null,null,null,null,null,null,null,null,null,null,null,null,null,null,null,null,null,null,null,null,null,null,null,null,null,null,null,null,null,null,null,null,null,null,null,null,"x"]
[null,3,{"$f":"C749","v":"G"},null,null,null,null,-1,"R30103_P5_R03Summa",{"$f":"\"L:\"&COLUMN(AS750)","v":"L:45"},{"$f":"RIGHT(IF(O749=\"\",AZ749,O749),LEN(IF(O749=\"\",AZ749,O749))/2)","v":""}]
[null,3,{"$f":"C752","v":""}]
[null,3,{"$f":"IF(C753=\"GS\",\"S\",\"\")","v":""},null,null,null,null,null,null,null,null,null,null,null,"Pārvietošana uz citu bilances posteni",null,null,null,null,null,null,null,null,null,null,null,null,null,null,null,null,null,null,null,null,null,null,null,null,null,null,null,null,null,"Summa",null,null,null,null,null,null,"Pārvietošana uz citu bilances posteni",null,null,null,null,null,null,null,null,null,null,null,null,null,null,null,null,null,null,null,null,null,null,null,null,null,null,null,null,null,"Summa"]
[null,3,{"$f":"IFERROR(IF(OR(AS753<>\"\",CD753<>\"\"),\"GS\",\"G\"),\"GS\")","v":"G"},null,null,null,null,null,"R30103_P5_R04",{"$f":"COLUMN(O753)","v":15},{"$f":"LEFT(IF(O753=\"\",AZ753,O753),LEN(IF(O753=\"\",AZ753,O753))/2)","v":""},null,null,null,null,null,null,null,null,null,null,null,null,null,null,null,null,null,null,null,null,null,null,null,null,null,null,null,null,null,null,null,null,null,null,null,null,null,null,null,null,null,null,null,null,null,null,null,null,null,null,null,null,null,null,null,null,null,null,null,null,null,null,null,null,null,null,null,null,null,null,null,null,null,null,null,"x"]
[null,3,{"$f":"C753","v":"G"},null,null,null,null,-1,"R30103_P5_R04Summa",{"$f":"\"L:\"&COLUMN(AS754)","v":"L:45"},{"$f":"RIGHT(IF(O753=\"\",AZ753,O753),LEN(IF(O753=\"\",AZ753,O753))/2)","v":""}]
[null,3]
[null,3,null,null,null,null,null,null,null,null,null,null,null,null,"Uzkrātās vērtības samazinājuma korekcijas:",null,null,null,null,null,null,null,null,null,null,null,null,null,null,null,null,null,null,null,null,null,null,null,null,null,null,null,null,null,"Summa",null,null,null,null,null,null,"Uzkrātās vērtības samazinājuma korekcijas:",null,null,null,null,null,null,null,null,null,null,null,null,null,null,null,null,null,null,null,null,null,null,null,null,null,null,null,null,null,"Summa"]
[null,3,{"$f":"IFERROR(IF(OR(COUNT(AS757:AU758)>0,COUNT(CD757:CF758)>0),\"GS\",\"G\"),\"GS\")","v":"G"},null,null,null,null,null,"R30103_P5_R0501",{"$f":"\"L:\"&COLUMN(AS757)","v":"L:45"},null,null,null,null,"pārskata gada sākumā",null,null,null,null,null,null,null,null,null,null,null,null,null,null,null,null,null,null,null,null,null,null,null,null,null,null,null,null,null,null,null,null,null,null,null,null,"pārskata gada sākumā"]
[null,3,{"$f":"C757","v":"G"},null,null,null,null,null,"R30103_P5_R0502",{"$f":"\"L:\"&COLUMN(AS758)","v":"L:45"},null,null,null,null,"pārskata gada beigās",null,null,null,null,null,null,null,null,null,null,null,null,null,null,null,null,null,null,null,null,null,null,null,null,null,null,null,null,null,null,null,null,null,null,null,null,"pārskata gada beigās"]
[null,3,{"$f":"C760","v":""}]
[null,3,{"$f":"IF(C761=\"GS\",\"S\",\"\")","v":""},null,null,null,null,null,null,null,null,null,null,null,"Pārskata gadā aprēķinātās vērtības samazinājuma korekcijas",null,null,null,null,null,null,null,null,null,null,null,null,null,null,null,null,null,null,null,null,null,null,null,null,null,null,null,null,null,"Summa",null,null,null,null,null,null,"Pārskata gadā aprēķinātās vērtības samazinājuma korekcijas",null,null,null,null,null,null,null,null,null,null,null,null,null,null,null,null,null,null,null,null,null,null,null,null,null,null,null,null,null,"Summa"]
[null,3,{"$f":"IFERROR(IF(OR(AS761<>\"\",CD761<>\"\"),\"GS\",\"G\"),\"GS\")","v":"G"},null,null,null,null,null,"R30103_P5_R06",{"$f":"COLUMN(O761)","v":15},{"$f":"LEFT(IF(O761=\"\",AZ761,O761),LEN(IF(O761=\"\",AZ761,O761))/2)","v":""},null,null,null,null,null,null,null,null,null,null,null,null,null,null,null,null,null,null,null,null,null,null,null,null,null,null,null,null,null,null,null,null,null,null,null,null,null,null,null,null,null,null,null,null,null,null,null,null,null,null,null,null,null,null,null,null,null,null,null,null,null,null,null,null,null,null,null,null,null,null,null,null,null,null,null,"x"]
[null,3,{"$f":"C761","v":"G"},null,null,null,null,-1,"R30103_P5_R06Summa",{"$f":"\"L:\"&COLUMN(AS762)","v":"L:45"},{"$f":"RIGHT(IF(O761=\"\",AZ761,O761),LEN(IF(O761=\"\",AZ761,O761))/2)","v":""}]
[null,3]
[null,3,null,null,null,null,null,null,"R30103_P5_R07",{"$f":"\"L:\"&COLUMN(AS764)","v":"L:45"},null,null,null,null,"Uzkrāto vērtības samazinājuma korekciju kopsummas izmaiņas saistībā ar objekta atsavināšanu, likvidāciju vai pārvietošanu uz citu posteni",null,null,null,null,null,null,null,null,null,null,null,null,null,null,null,null,null,null,null,null,null,null,null,null,null,null,null,null,null,null,null,null,null,null,null,null,"Uzkrāto vērtības samazinājuma korekciju kopsummas izmaiņas saistībā ar objekta atsavināšanu, likvidāciju vai pārvietošanu uz citu posteni"]
[null,3]
[null,3,null,null,null,null,null,null,null,null,null,null,null,null,"Bilances vērtība:",null,null,null,null,null,null,null,null,null,null,null,null,null,null,null,null,null,null,null,null,null,null,null,null,null,null,null,null,null,"Summa",null,null,null,null,null,null,"Bilances vērtība:",null,null,null,null,null,null,null,null,null,null,null,null,null,null,null,null,null,null,null,null,null,null,null,null,null,null,null,null,null,"Summa"]
[null,3,{"$f":"IFERROR(IF(OR(COUNT(AS767:AU768)>0,COUNT(CD767:CF768)>0),\"GS\",\"G\"),\"GS\")","v":"G"},null,null,null,null,null,"R30103_P5_R0701",{"$f":"\"L:\"&COLUMN(AS767)","v":"L:45"},null,null,null,null,"pārskata gada sākumā",null,null,null,null,null,null,null,null,null,null,null,null,null,null,null,null,null,null,null,null,null,null,null,null,null,null,null,null,null,null,null,null,null,null,null,null,"pārskata gada sākumā"]
[null,3,{"$f":"C767","v":"G"},null,null,null,null,null,"R30103_P5_R0702",{"$f":"\"L:\"&COLUMN(AS768)","v":"L:45"},null,null,null,null,"pārskata gada beigās",null,null,null,null,null,null,null,null,null,null,null,null,null,null,null,null,null,null,null,null,null,null,null,null,null,null,null,null,null,null,null,null,null,null,null,null,"pārskata gada beigās"]
[null,3,{"$f":"C770","v":""}]
[null,3,{"$f":"IF(C771=\"GS\",\"S\",\"\")","v":""},null,null,null,null,null,null,null,null,null,null,null,"Papildus sniegtā informācija, ja tāda ir",null,null,null,null,null,null,null,null,null,null,null,null,null,null,null,null,null,null,null,null,null,null,null,null,null,null,null,null,null,null,null,null,null,null,null,null,"Papildus sniegtā informācija, ja tāda ir"]
[null,3,{"$f":"IFERROR(IF(OR(O771<>\"\",AZ771<>\"\"),\"GS\",\"G\"),\"GS\")","v":"G"},null,null,null,null,null,"R30103_P5_R08",{"$f":"COLUMN(O771)","v":15},{"$f":"LEFT(IF(O771=\"\",AZ771,O771),LEN(IF(O771=\"\",AZ771,O771))/2)","v":""},null,null,null,null,null,null,null,null,null,null,null,null,null,null,null,null,null,null,null,null,null,null,null,null,null,null,null,null,null,null,null,null,null,null,null,null,null,null,null,null,null,null,null,null,null,null,null,null,null,null,null,null,null,null,null,null,null,null,null,null,null,null,null,null,null,null,null,null,null,null,null,null,null,null,null,"x"]
[null,3,{"$f":"C771","v":"G"},null,null,null,null,null,null,{"$f":"COLUMN(O772)","v":15},{"$f":"RIGHT(IF(O771=\"\",AZ771,O771),LEN(IF(O771=\"\",AZ771,O771))/2)","v":""}]
[null,3]
[null,3,null,null,null,"x","x",null,null,null,null,null,null,"3.1.4.","skaidrojums par finanšu instrumentiem, kas novērtēti patiesajā vērtībā",null,null,null,null,null,null,null,null,null,null,null,null,null,null,null,null,null,null,null,null,null,null,null,null,null,null,null,null,null,null,null,null,null,null,null,"3.1.4.","skaidrojums par finanšu instrumentiem, kas novērtēti patiesajā vērtībā"]
[null,3,null,null,null,null,null,null,null,null,null,null,null,null,"Nozīmīgākie pieņēmumi novērtēšanai patiesajā vērtībā, ja novērtēšanu nevar ticami veikt atbilstoši likuma 37.panta pirmajai daļai un finanšu instrumentus novērtē saskaņā ar likuma 14.panta pirmās daļas 10.punktu"]
[null,3]
[null,3]
[null,3,null,null,null,null,null,null,null,null,null,null,null,null,"Kategorija",null,null,null,null,null,null,null,null,"Patiesā vērtība",null,null,null,"Patiesās vērtības izmaiņas, kas ietvertas peļņas vai zaudējumu aprēķinā",null,null,null,"Patiesās vērtības izmaiņas, kas ietvertas postenī \"Finanšu instrumentu patiesās vērtības rezerve\"",null,null,null,null,null,null,null,null,null,null,null,null,null,null,null,null,null,null,null,"Kategorija",null,null,null,null,null,null,null,null,"Patiesā vērtība",null,null,null,"Patiesās vērtības izmaiņas, kas ietvertas peļņas vai zaudējumu aprēķinā",null,null,null,"Patiesās vērtības izmaiņas, kas ietvertas postenī \"Finanšu instrumentu patiesās vērtības rezerve\""]
[null,3]
[null,3]
[null,3]
[null,3]
[null,3,{"$f":"IF(C784=\"GS\",\"S\",\"\")","v":""}]
[null,3,{"$f":"IFERROR(IF(OR(O784<>\"\",AZ784<>\"\"),\"GS\",\"G\"),\"GS\")","v":"G"},null,null,null,null,null,"R3010401",{"$f":"COLUMN(O784)&\";L:\"&COLUMN(X784)&\";L:\"&COLUMN(AB784)&\";L:\"&COLUMN(AF784)","v":"15;L:24;L:28;L:32"},null,null,null,1,null,null,null,null,null,null,null,null,null,null,null,null,null,null,null,null,null,null,null,null,null,null,null,null,null,null,null,null,null,null,null,null,null,null,null,null,1]
[null,3,"G",null,null,null,null,null,"R3010401","15;L:24;L:28;L:32",null,null,null,2,null,null,null,null,null,null,null,null,null,null,null,null,null,null,null,null,null,null,null,null,null,null,null,null,null,null,null,null,null,null,null,null,null,null,null,null,2]
[null,3,"G",null,null,null,null,null,"R3010401","15;L:24;L:28;L:32",null,null,null,3,null,null,null,null,null,null,null,null,null,null,null,null,null,null,null,null,null,null,null,null,null,null,null,null,null,null,null,null,null,null,null,null,null,null,null,null,3]
[null,3,"G",null,null,null,null,null,"R3010401","15;L:24;L:28;L:32",null,null,null,4,null,null,null,null,null,null,null,null,null,null,null,null,null,null,null,null,null,null,null,null,null,null,null,null,null,null,null,null,null,null,null,null,null,null,null,null,4]
[null,3,"G",null,null,null,null,null,"R3010401","15;L:24;L:28;L:32",null,null,null,5,null,null,null,null,null,null,null,null,null,null,null,null,null,null,null,null,null,null,null,null,null,null,null,null,null,null,null,null,null,null,null,null,null,null,null,null,5]
[null,3,"G",null,null,null,null,null,"R3010401","15;L:24;L:28;L:32",null,null,null,6,null,null,null,null,null,null,null,null,null,null,null,null,null,null,null,null,null,null,null,null,null,null,null,null,null,null,null,null,null,null,null,null,null,null,null,null,6]
[null,3,"G",null,null,null,null,null,"R3010401","15;L:24;L:28;L:32",null,null,null,7,null,null,null,null,null,null,null,null,null,null,null,null,null,null,null,null,null,null,null,null,null,null,null,null,null,null,null,null,null,null,null,null,null,null,null,null,7]
[null,3,"G",null,null,null,null,null,"R3010401","15;L:24;L:28;L:32",null,null,null,8,null,null,null,null,null,null,null,null,null,null,null,null,null,null,null,null,null,null,null,null,null,null,null,null,null,null,null,null,null,null,null,null,null,null,null,null,8]
[null,3,"G",null,null,null,null,null,"R3010401","15;L:24;L:28;L:32",null,null,null,9,null,null,null,null,null,null,null,null,null,null,null,null,null,null,null,null,null,null,null,null,null,null,null,null,null,null,null,null,null,null,null,null,null,null,null,null,9]
[null,3,"G",null,null,null,null,null,"R3010401","15;L:24;L:28;L:32",null,null,null,10,null,null,null,null,null,null,null,null,null,null,null,null,null,null,null,null,null,null,null,null,null,null,null,null,null,null,null,null,null,null,null,null,null,null,null,null,10]
[null,3,{"$f":"C795","v":""}]
[null,3,{"$f":"IF(C796=\"GS\",\"S\",\"\")","v":""},null,null,null,null,null,null,null,null,null,null,"Papildus sniegtā informācija, ja tāda ir",null,null,null,null,null,null,null,null,null,null,null,null,null,null,null,null,null,null,null,null,null,null,null,null,null,null,null,null,null,null,null,null,null,null,null,null,"Papildus sniegtā informācija, ja tāda ir"]
[null,3,{"$f":"IF(OR(N796<>\"\",AY796<>\"\"),\"GS\",\"G\")","v":"G"},null,null,null,null,null,"R3010402",{"$f":"COLUMN(N796)","v":14},{"$f":"LEFT(IF(N796=\"\",AY796,N796),LEN(IF(N796=\"\",AY796,N796))/2)","v":""},null,null,null,null,null,null,null,null,null,null,null,null,null,null,null,null,null,null,null,null,null,null,null,null,null,null,null,null,null,null,null,null,null,null,null,null,null,null,null,null,null,null,null,null,null,null,null,null,null,null,null,null,null,null,null,null,null,null,null,null,null,null,null,null,null,null,null,null,null,null,null,null,null,null,null,"x"]
[null,3,{"$f":"C796","v":"G"},null,null,null,null,null,null,{"$f":"COLUMN(N797)","v":14},{"$f":"RIGHT(IF(N796=\"\",AY796,N796),LEN(IF(N796=\"\",AY796,N796))/2)","v":""}]
[null,4,{"$f":"C799","v":""}]
[null,4,"",null,null,null,"x",null,null,null,null,null,null,"3.1.5.","skaidrojums par finanšu instrumentiem, ja tiem nav piemērota novērtēšana patiesajā vērtībā",null,null,null,null,null,null,null,null,null,null,null,null,null,null,null,null,null,null,null,null,null,null,null,null,null,null,null,null,null,null,null,null,null,null,null,"3.1.5.","skaidrojums par finanšu instrumentiem, ja tiem nav piemērota novērtēšana patiesajā vērtībā"]
[null,4,""]
[null,4,"",null,null,null,null,null,null,null,null,null,null,null,"Grupa",null,null,null,null,null,null,null,null,"Bilances vērtība",null,null,null,"Patiesā vērtība (Ja to var noteikt ar kādu no likuma 37.pantā minētajām metodēm)",null,null,null,"Starpība",null,null,null,null,null,null,null,null,null,null,null,null,null,null,null,null,null,null,null,"Grupa",null,null,null,null,null,null,null,null,"Bilances vērtība",null,null,null,"Patiesā vērtība (Ja to var noteikt ar kādu no likuma 37.pantā minētajām metodēm)",null,null,null,"Starpība"]
[null,4,""]
[null,4,""]
[null,4,{"$f":"C805","v":""}]
[null,4,{"$f":"IF(C806=\"GS\",\"S\",\"\")","v":""}]
[null,4,{"$f":"IFERROR(IF(OR(O806<>\"\",AZ806<>\"\"),\"GS\",\"G\"),\"GS\")","v":"G"},null,null,null,null,null,"R30105",{"$f":"COLUMN(O806)&\";L:\"&COLUMN(X806)&\";L:\"&COLUMN(AB806)","v":"15;L:24;L:28"},null,null,null,1,null,null,null,null,null,null,null,null,null,null,null,null,null,null,null,null,null,{"$f":"X806-AB806","v":0},null,null,null,null,null,null,null,null,null,null,null,null,null,null,null,null,null,null,1,null,null,null,null,null,null,null,null,null,null,null,null,null,null,null,null,null,{"$f":"BI806-BM806","v":0}]
[null,4,"G",null,null,null,null,null,"R30105","15;L:24;L:28",null,null,null,2,null,null,null,null,null,null,null,null,null,null,null,null,null,null,null,null,null,{"$f":"X807-AB807","v":0},null,null,null,null,null,null,null,null,null,null,null,null,null,null,null,null,null,null,2,null,null,null,null,null,null,null,null,null,null,null,null,null,null,null,null,null,{"$f":"BI807-BM807","v":0}]
[null,4,"G",null,null,null,null,null,"R30105","15;L:24;L:28",null,null,null,3,null,null,null,null,null,null,null,null,null,null,null,null,null,null,null,null,null,0,null,null,null,null,null,null,null,null,null,null,null,null,null,null,null,null,null,null,3,null,null,null,null,null,null,null,null,null,null,null,null,null,null,null,null,null,0]
[null,4,"G",null,null,null,null,null,"R30105","15;L:24;L:28",null,null,null,4,null,null,null,null,null,null,null,null,null,null,null,null,null,null,null,null,null,0,null,null,null,null,null,null,null,null,null,null,null,null,null,null,null,null,null,null,4,null,null,null,null,null,null,null,null,null,null,null,null,null,null,null,null,null,0]
[null,4,"G",null,null,null,null,null,"R30105","15;L:24;L:28",null,null,null,5,null,null,null,null,null,null,null,null,null,null,null,null,null,null,null,null,null,0,null,null,null,null,null,null,null,null,null,null,null,null,null,null,null,null,null,null,5,null,null,null,null,null,null,null,null,null,null,null,null,null,null,null,null,null,0]
[null,4,"G",null,null,null,null,null,"R30105","15;L:24;L:28",null,null,null,6,null,null,null,null,null,null,null,null,null,null,null,null,null,null,null,null,null,0,null,null,null,null,null,null,null,null,null,null,null,null,null,null,null,null,null,null,6,null,null,null,null,null,null,null,null,null,null,null,null,null,null,null,null,null,0]
[null,4,"G",null,null,null,null,null,"R30105","15;L:24;L:28",null,null,null,7,null,null,null,null,null,null,null,null,null,null,null,null,null,null,null,null,null,0,null,null,null,null,null,null,null,null,null,null,null,null,null,null,null,null,null,null,7,null,null,null,null,null,null,null,null,null,null,null,null,null,null,null,null,null,0]
[null,4,"G",null,null,null,null,null,"R30105","15;L:24;L:28",null,null,null,8,null,null,null,null,null,null,null,null,null,null,null,null,null,null,null,null,null,0,null,null,null,null,null,null,null,null,null,null,null,null,null,null,null,null,null,null,8,null,null,null,null,null,null,null,null,null,null,null,null,null,null,null,null,null,0]
[null,4,"G",null,null,null,null,null,"R30105","15;L:24;L:28",null,null,null,9,null,null,null,null,null,null,null,null,null,null,null,null,null,null,null,null,null,0,null,null,null,null,null,null,null,null,null,null,null,null,null,null,null,null,null,null,9,null,null,null,null,null,null,null,null,null,null,null,null,null,null,null,null,null,0]
[null,4,"G",null,null,null,null,null,"R30105","15;L:24;L:28",null,null,null,10,null,null,null,null,null,null,null,null,null,null,null,null,null,null,null,null,null,0,null,null,null,null,null,null,null,null,null,null,null,null,null,null,null,null,null,null,10,null,null,null,null,null,null,null,null,null,null,null,null,null,null,null,null,null,0]
[null,4,{"$f":"C805","v":""}]
[null,4,{"$f":"IF(C818=\"GS\",\"S\",\"\")","v":""},null,null,null,null,null,null,null,null,null,null,"Papildus sniegtā informācija, ja tāda ir",null,null,null,null,null,null,null,null,null,null,null,null,null,null,null,null,null,null,null,null,null,null,null,null,null,null,null,null,null,null,null,null,null,null,null,null,"Papildus sniegtā informācija, ja tāda ir"]
[null,4,{"$f":"IFERROR(IF(OR(N818<>\"\",AY818<>\"\"),\"GS\",\"G\"),\"GS\")","v":"G"},null,null,null,null,null,"R3010501",{"$f":"COLUMN(N818)","v":14},{"$f":"LEFT(IF(LEN(N818)<LEN(AY818),AY818,N818),LEN(IF(LEN(N818)<LEN(AY818),AY818,N818))/2)","v":""},null,null,null,null,null,null,null,null,null,null,null,null,null,null,null,null,null,null,null,null,null,null,null,null,null,null,null,null,null,null,null,null,null,null,null,null,null,null,null,null,null,null,null,null,null,null,null,null,null,null,null,null,null,null,null,null,null,null,null,null,null,null,null,null,null,null,null,null,null,null,null,null,null,null,null,"x"]
[null,4,{"$f":"C818","v":"G"},null,null,null,null,null,null,{"$f":"COLUMN(N819)","v":14},{"$f":"RIGHT(IF(LEN(N818)<LEN(AY818),AY818,N818),LEN(IF(LEN(N818)<LEN(AY818),AY818,N818))/2)","v":""}]
[null,4,{"$f":"C821","v":""}]
[null,4,"",null,null,null,"x",null,null,null,null,null,null,"3.1.6.","skaidrojums par to, ka nav paredzēta likuma 23.panta trešajā daļā paredzētā iespēja piemērot vērtības samazināšanu, finanšu ieguldījumiem, kuru patiesā vērtība ir mazāka par bilances vērtību",null,null,null,null,null,null,null,null,null,null,null,null,null,null,null,null,null,null,null,null,null,null,null,null,null,null,null,null,null,null,null,null,null,null,null,"3.1.6.","skaidrojums par to, ka nav paredzēta likuma 23.panta trešajā daļā paredzētā iespēja piemērot vērtības samazināšanu, finanšu ieguldījumiem, kuru patiesā vērtība ir mazāka par bilances vērtību"]
[null,4,""]
[null,4,{"$f":"C824","v":""}]
[null,4,{"$f":"IF(C825=\"GS\",\"S\",\"\")","v":""},null,null,null,null,null,null,null,null,null,null,null,"Bilances vērtība",null,null,null,null,"Patiesā vērtība",null,null,null,"Paskaidrojums, kāpēc nav piemērota vērtības samazināšana \t",null,null,null,null,null,null,null,null,null,null,null,null,null,null,null,null,null,null,null,null,null,null,null,null,null,null,null,"Bilances vērtība",null,null,null,null,"Patiesā vērtība",null,null,null,"Paskaidrojums, kāpēc nav piemērota vērtības samazināšana \t"]
[null,4,{"$f":"IFERROR(IF(OR(O825<>\"\",AZ825<>\"\"),\"GS\",\"G\"),\"GS\")","v":"G"},null,null,null,null,null,"R30106",{"$f":"\"L:\"&COLUMN(O825)&\";L:\"&COLUMN(T825)&\";\"&COLUMN(X825)","v":"L:15;L:20;24"},null,null,null,1,null,null,null,null,null,null,null,null,null,null,null,null,null,null,null,null,null,null,null,null,null,null,null,null,null,null,null,null,null,null,null,null,null,null,null,null,1]
[null,4,"G",null,null,null,null,null,"R30106","L:15;L:20;24",null,null,null,2,null,null,null,null,null,null,null,null,null,null,null,null,null,null,null,null,null,null,null,null,null,null,null,null,null,null,null,null,null,null,null,null,null,null,null,null,2]
[null,4,"G",null,null,null,null,null,"R30106","L:15;L:20;24",null,null,null,3,null,null,null,null,null,null,null,null,null,null,null,null,null,null,null,null,null,null,null,null,null,null,null,null,null,null,null,null,null,null,null,null,null,null,null,null,3]
[null,4,"G",null,null,null,null,null,"R30106","L:15;L:20;24",null,null,null,4,null,null,null,null,null,null,null,null,null,null,null,null,null,null,null,null,null,null,null,null,null,null,null,null,null,null,null,null,null,null,null,null,null,null,null,null,4]
[null,4,"G",null,null,null,null,null,"R30106","L:15;L:20;24",null,null,null,5,null,null,null,null,null,null,null,null,null,null,null,null,null,null,null,null,null,null,null,null,null,null,null,null,null,null,null,null,null,null,null,null,null,null,null,null,5]
[null,4,"G",null,null,null,null,null,"R30106","L:15;L:20;24",null,null,null,6,null,null,null,null,null,null,null,null,null,null,null,null,null,null,null,null,null,null,null,null,null,null,null,null,null,null,null,null,null,null,null,null,null,null,null,null,6]
[null,4,"G",null,null,null,null,null,"R30106","L:15;L:20;24",null,null,null,7,null,null,null,null,null,null,null,null,null,null,null,null,null,null,null,null,null,null,null,null,null,null,null,null,null,null,null,null,null,null,null,null,null,null,null,null,7]
[null,4,"G",null,null,null,null,null,"R30106","L:15;L:20;24",null,null,null,8,null,null,null,null,null,null,null,null,null,null,null,null,null,null,null,null,null,null,null,null,null,null,null,null,null,null,null,null,null,null,null,null,null,null,null,null,8]
[null,4,"G",null,null,null,null,null,"R30106","L:15;L:20;24",null,null,null,9,null,null,null,null,null,null,null,null,null,null,null,null,null,null,null,null,null,null,null,null,null,null,null,null,null,null,null,null,null,null,null,null,null,null,null,null,9]
[null,4,"G",null,null,null,null,null,"R30106","L:15;L:20;24",null,null,null,10,null,null,null,null,null,null,null,null,null,null,null,null,null,null,null,null,null,null,null,null,null,null,null,null,null,null,null,null,null,null,null,null,null,null,null,null,10]
[null,4,{"$f":"C836","v":""}]
[null,4,{"$f":"IF(C837=\"GS\",\"S\",\"\")","v":""},null,null,null,null,null,null,null,null,null,null,"Papildus sniegtā informācija, ja tāda ir",null,null,null,null,null,null,null,null,null,null,null,null,null,null,null,null,null,null,null,null,null,null,null,null,null,null,null,null,null,null,null,null,null,null,null,null,"Papildus sniegtā informācija, ja tāda ir"]
[null,4,{"$f":"IFERROR(IF(OR(N837<>\"\",AY837<>\"\"),\"GS\",\"G\"),\"GS\")","v":"G"},null,null,null,null,null,"R3010601",{"$f":"COLUMN(N837)","v":14},{"$f":"LEFT(IF(LEN(N837)<LEN(AY837),AY837,N837),LEN(IF(LEN(N837)<LEN(AY837),AY837,N837))/2)","v":""},null,null,null,null,null,null,null,null,null,null,null,null,null,null,null,null,null,null,null,null,null,null,null,null,null,null,null,null,null,null,null,null,null,null,null,null,null,null,null,null,null,null,null,null,null,null,null,null,null,null,null,null,null,null,null,null,null,null,null,null,null,null,null,null,null,null,null,null,null,null,null,null,null,null,null,"x"]
[null,4,{"$f":"C837","v":"G"},null,null,null,null,null,null,{"$f":"COLUMN(N838)","v":14},{"$f":"RIGHT(IF(LEN(N837)<LEN(AY837),AY837,N837),LEN(IF(LEN(N837)<LEN(AY837),AY837,N837))/2)","v":""}]
[null,4,{"$f":"C840","v":""}]
[null,4,{"$f":"C841","v":""},null,null,null,"x",null,null,null,null,null,null,"3.1.7.","informācija par finanšu instrumentiem (līdzdalības apliecības, regulētā tirgū tirgotas garantijas, iespējas līgumi, utt.)",null,null,null,null,null,null,null,null,null,null,null,null,null,null,null,null,null,null,null,null,null,null,null,null,null,null,null,null,null,null,null,null,null,null,null,"3.1.7.","informācija par finanšu instrumentiem (līdzdalības apliecības, regulētā tirgū tirgotas garantijas, iespējas līgumi, utt.)"]
[null,4,{"$f":"C842","v":""}]
[null,4,{"$f":"IF(C843=\"GS\",\"S\",\"\")","v":""},null,null,null,null,null,null,null,null,null,null,null,"Finanšu instruments",null,null,null,null,null,null,null,null,"Skaits",null,null,null,"Tiesības, kādas tas piešķir",null,null,null,null,null,null,null,null,null,null,null,null,null,null,null,null,null,null,null,null,null,null,null,"Finanšu instruments",null,null,null,null,null,null,null,null,"Skaits",null,null,null,"Tiesības, kādas tas piešķir"]
[null,4,{"$f":"IFERROR(IF(OR(O843<>\"\",AZ843<>\"\"),\"GS\",\"G\"),\"GS\")","v":"G"},null,null,null,null,null,"R30107",{"$f":"COLUMN(O843)&\";L:\"&COLUMN(X843)&\";\"&COLUMN(AB843)","v":"15;L:24;28"},null,null,null,1,null,null,null,null,null,null,null,null,null,null,null,null,null,null,null,null,null,null,null,null,null,null,null,null,null,null,null,null,null,null,null,null,null,null,null,null,1]
[null,4,"G",null,null,null,null,null,"R30107","15;L:24;28",null,null,null,2,null,null,null,null,null,null,null,null,null,null,null,null,null,null,null,null,null,null,null,null,null,null,null,null,null,null,null,null,null,null,null,null,null,null,null,null,2]
[null,4,"G",null,null,null,null,null,"R30107","15;L:24;28",null,null,null,3,null,null,null,null,null,null,null,null,null,null,null,null,null,null,null,null,null,null,null,null,null,null,null,null,null,null,null,null,null,null,null,null,null,null,null,null,3]
[null,4,"G",null,null,null,null,null,"R30107","15;L:24;28",null,null,null,4,null,null,null,null,null,null,null,null,null,null,null,null,null,null,null,null,null,null,null,null,null,null,null,null,null,null,null,null,null,null,null,null,null,null,null,null,4]
[null,4,"G",null,null,null,null,null,"R30107","15;L:24;28",null,null,null,5,null,null,null,null,null,null,null,null,null,null,null,null,null,null,null,null,null,null,null,null,null,null,null,null,null,null,null,null,null,null,null,null,null,null,null,null,5]
[null,4,"G",null,null,null,null,null,"R30107","15;L:24;28",null,null,null,6,null,null,null,null,null,null,null,null,null,null,null,null,null,null,null,null,null,null,null,null,null,null,null,null,null,null,null,null,null,null,null,null,null,null,null,null,6]
[null,4,"G",null,null,null,null,null,"R30107","15;L:24;28",null,null,null,7,null,null,null,null,null,null,null,null,null,null,null,null,null,null,null,null,null,null,null,null,null,null,null,null,null,null,null,null,null,null,null,null,null,null,null,null,7]
[null,4,"G",null,null,null,null,null,"R30107","15;L:24;28",null,null,null,8,null,null,null,null,null,null,null,null,null,null,null,null,null,null,null,null,null,null,null,null,null,null,null,null,null,null,null,null,null,null,null,null,null,null,null,null,8]
[null,4,"G",null,null,null,null,null,"R30107","15;L:24;28",null,null,null,9,null,null,null,null,null,null,null,null,null,null,null,null,null,null,null,null,null,null,null,null,null,null,null,null,null,null,null,null,null,null,null,null,null,null,null,null,9]
[null,4,"G",null,null,null,null,null,"R30107","15;L:24;28",null,null,null,10,null,null,null,null,null,null,null,null,null,null,null,null,null,null,null,null,null,null,null,null,null,null,null,null,null,null,null,null,null,null,null,null,null,null,null,null,10]
[null,4,{"$f":"C854","v":""}]
[null,4,{"$f":"IF(C855=\"GS\",\"S\",\"\")","v":""},null,null,null,null,null,null,null,null,null,null,"Papildus sniegtā informācija, ja tāda ir",null,null,null,null,null,null,null,null,null,null,null,null,null,null,null,null,null,null,null,null,null,null,null,null,null,null,null,null,null,null,null,null,null,null,null,null,"Papildus sniegtā informācija, ja tāda ir"]
[null,4,{"$f":"IFERROR(IF(OR(N855<>\"\",AY855<>\"\"),\"GS\",\"G\"),\"GS\")","v":"G"},null,null,null,null,null,"R3010701",{"$f":"COLUMN(N855)","v":14},{"$f":"LEFT(IF(LEN(N855)<LEN(AY855),AY855,N855),LEN(IF(LEN(N855)<LEN(AY855),AY855,N855))/2)","v":""},null,null,null,null,null,null,null,null,null,null,null,null,null,null,null,null,null,null,null,null,null,null,null,null,null,null,null,null,null,null,null,null,null,null,null,null,null,null,null,null,null,null,null,null,null,null,null,null,null,null,null,null,null,null,null,null,null,null,null,null,null,null,null,null,null,null,null,null,null,null,null,null,null,null,null,"x"]
[null,4,{"$f":"C855","v":"G"},null,null,null,null,null,null,{"$f":"COLUMN(N856)","v":14},{"$f":"RIGHT(IF(LEN(N855)<LEN(AY855),AY855,N855),LEN(IF(LEN(N855)<LEN(AY855),AY855,N855))/2)","v":""}]
[null,1]
[null,1,null,"x","x","x","x",null,null,null,null,null,null,"3.1.8.","informācija par savu akciju vai daļu kopumu",null,null,null,null,null,null,null,null,null,null,null,null,null,null,null,null,null,null,null,null,null,null,null,null,null,null,null,null,null,null,null,null,null,null,null,"3.1.8.","informācija par savu akciju vai daļu kopumu"]
[null,1,null,null,null,null,null,null,null,null,null,null,null,null,"Akcijas vai daļas",null,null,null,null,"Skaits",null,null,null,"Nomināl-vērtība",null,null,null,"Kopsumma",null,null,null,"Uzskaites \nvērtības kopsumma",null,null,null,"Īpatsvars pamatkapitālā (%)",null,null,null,"Iemesls to iegādei \npārskata gadā",null,null,null,null,null,null,null,null,null,null,null,"Akcijas vai daļas",null,null,null,null,"Skaits",null,null,null,"Nomināl-vērtība",null,null,null,"Kopsumma",null,null,null,"Uzskaites \nvērtības kopsumma",null,null,null,"Īpatsvars pamatkapitālā (%)",null,null,null,"Iemesls to iegādei \npārskata gadā"]
[null,1]
[null,1]
[null,1,{"$f":"IF(C863=\"GS\",\"S\",\"\")","v":""}]
[null,1,{"$f":"IFERROR(IF(OR(O863<>\"\",AZ863<>\"\"),\"GS\",\"G\"),\"GS\")","v":"G"},null,null,null,null,null,"R30108",{"$f":"COLUMN(O863)&\";L:\"&COLUMN(T863)&\";N:\"&COLUMN(X863)&\";N:\"&COLUMN(AB863)&\";L:\"&COLUMN(AF863)&\";N:\"&COLUMN(AJ863)&\";\"&COLUMN(AN863)","v":"15;L:20;N:24;N:28;L:32;N:36;40"},null,null,null,1,null,null,null,null,null,null,null,null,null,null,null,null,null,null,null,null,null,null,null,null,null,null,null,null,null,null,null,null,null,null,null,null,null,null,null,null,1]
[null,1,"G",null,null,null,null,null,"R30108",{"$f":"COLUMN(O864)&\";L:\"&COLUMN(T864)&\";N:\"&COLUMN(X864)&\";N:\"&COLUMN(AB864)&\";L:\"&COLUMN(AF864)&\";N:\"&COLUMN(AJ864)&\";\"&COLUMN(AN864)","v":"15;L:20;N:24;N:28;L:32;N:36;40"},null,null,null,2,null,null,null,null,null,null,null,null,null,null,null,null,null,null,null,null,null,null,null,null,null,null,null,null,null,null,null,null,null,null,null,null,null,null,null,null,2]
[null,1,"G",null,null,null,null,null,"R30108","15;L:20;N:24;N:28;L:32;N:36;40",null,null,null,3,null,null,null,null,null,null,null,null,null,null,null,null,null,null,null,null,null,null,null,null,null,null,null,null,null,null,null,null,null,null,null,null,null,null,null,null,3]
[null,1,"G",null,null,null,null,null,"R30108","15;L:20;N:24;N:28;L:32;N:36;40",null,null,null,4,null,null,null,null,null,null,null,null,null,null,null,null,null,null,null,null,null,null,null,null,null,null,null,null,null,null,null,null,null,null,null,null,null,null,null,null,4]
[null,1,"G",null,null,null,null,null,"R30108","15;L:20;N:24;N:28;L:32;N:36;40",null,null,null,5,null,null,null,null,null,null,null,null,null,null,null,null,null,null,null,null,null,null,null,null,null,null,null,null,null,null,null,null,null,null,null,null,null,null,null,null,5]
[null,1,"G",null,null,null,null,null,"R30108","15;L:20;N:24;N:28;L:32;N:36;40",null,null,null,6,null,null,null,null,null,null,null,null,null,null,null,null,null,null,null,null,null,null,null,null,null,null,null,null,null,null,null,null,null,null,null,null,null,null,null,null,6]
[null,1,"G",null,null,null,null,null,"R30108","15;L:20;N:24;N:28;L:32;N:36;40",null,null,null,7,null,null,null,null,null,null,null,null,null,null,null,null,null,null,null,null,null,null,null,null,null,null,null,null,null,null,null,null,null,null,null,null,null,null,null,null,7]
[null,1,"G",null,null,null,null,null,"R30108","15;L:20;N:24;N:28;L:32;N:36;40",null,null,null,8,null,null,null,null,null,null,null,null,null,null,null,null,null,null,null,null,null,null,null,null,null,null,null,null,null,null,null,null,null,null,null,null,null,null,null,null,8]
[null,1,"G",null,null,null,null,null,"R30108","15;L:20;N:24;N:28;L:32;N:36;40",null,null,null,9,null,null,null,null,null,null,null,null,null,null,null,null,null,null,null,null,null,null,null,null,null,null,null,null,null,null,null,null,null,null,null,null,null,null,null,null,9]
[null,1,"G",null,null,null,null,null,"R30108","15;L:20;N:24;N:28;L:32;N:36;40",null,null,null,10,null,null,null,null,null,null,null,null,null,null,null,null,null,null,null,null,null,null,null,null,null,null,null,null,null,null,null,null,null,null,null,null,null,null,null,null,10]
[null,1,{"$f":"C874","v":""}]
[null,1,{"$f":"IF(C875=\"GS\",\"S\",\"\")","v":""},null,null,null,null,null,null,null,null,null,null,"Papildus sniegtā informācija, ja tāda ir",null,null,null,null,null,null,null,null,null,null,null,null,null,null,null,null,null,null,null,null,null,null,null,null,null,null,null,null,null,null,null,null,null,null,null,null,"Papildus sniegtā informācija, ja tāda ir"]
[null,1,{"$f":"IFERROR(IF(OR(N875<>\"\",AY875<>\"\"),\"GS\",\"G\"),\"GS\")","v":"G"},"x","x","x","x",null,"R3010801",{"$f":"COLUMN(N875)","v":14},{"$f":"LEFT(IF(LEN(N875)<LEN(AY875),AY875,N875),LEN(IF(LEN(N875)<LEN(AY875),AY875,N875))/2)","v":""},null,null,null,null,null,null,null,null,null,null,null,null,null,null,null,null,null,null,null,null,null,null,null,null,null,null,null,null,null,null,null,null,null,null,null,null,null,null,null,null,null,null,null,null,null,null,null,null,null,null,null,null,null,null,null,null,null,null,null,null,null,null,null,null,null,null,null,null,null,null,null,null,null,null,null,"x"]
[null,1,{"$f":"C875","v":"G"},null,null,null,null,null,null,{"$f":"COLUMN(N876)","v":14},{"$f":"RIGHT(IF(LEN(N875)<LEN(AY875),AY875,N875),LEN(IF(LEN(N875)<LEN(AY875),AY875,N875))/2)","v":""}]
[null,2]
[null,2,null,null,"x","x","x",null,null,null,null,null,null,"3.1.9.","atvasinātie finanšu instrumenti",null,null,null,null,null,null,null,null,null,null,null,null,null,null,null,null,null,null,null,null,null,null,null,null,null,null,null,null,null,null,null,null,null,null,null,"3.1.9.","atvasinātie finanšu instrumenti"]
[null,2]
[null,2,null,null,null,null,null,null,null,null,null,null,null,null,"Grupa",null,null,null,null,null,null,null,null,"Vērtību kopsumma",null,null,null,"Būtiski nosacījumi, kas varētu \nietekmēt nākotnes naudas plūsmu",null,null,null,null,null,null,null,null,null,null,null,null,null,null,null,null,null,null,null,null,null,null,null,"Grupa",null,null,null,null,null,null,null,null,"Vērtību kopsumma",null,null,null,"Būtiski nosacījumi, kas varētu \nietekmēt nākotnes naudas plūsmu"]
[null,2,{"$f":"IF(C882=\"GS\",\"S\",\"\")","v":""}]
[null,2,{"$f":"IFERROR(IF(OR(O882<>\"\",AZ882<>\"\"),\"GS\",\"G\"),\"GS\")","v":"G"},null,null,null,null,null,"R30109",{"$f":"COLUMN(O882)&\";L:\"&COLUMN(X882)&\";\"&COLUMN(AB882)","v":"15;L:24;28"},null,null,null,1,null,null,null,null,null,null,null,null,null,null,null,null,null,null,null,null,null,null,null,null,null,null,null,null,null,null,null,null,null,null,null,null,null,null,null,null,1]
[null,2,"G",null,null,null,null,null,"R30109","15;L:24;28",null,null,null,2,null,null,null,null,null,null,null,null,null,null,null,null,null,null,null,null,null,null,null,null,null,null,null,null,null,null,null,null,null,null,null,null,null,null,null,null,2]
[null,2,"G",null,null,null,null,null,"R30109","15;L:24;28",null,null,null,3,null,null,null,null,null,null,null,null,null,null,null,null,null,null,null,null,null,null,null,null,null,null,null,null,null,null,null,null,null,null,null,null,null,null,null,null,3]
[null,2,"G",null,null,null,null,null,"R30109","15;L:24;28",null,null,null,4,null,null,null,null,null,null,null,null,null,null,null,null,null,null,null,null,null,null,null,null,null,null,null,null,null,null,null,null,null,null,null,null,null,null,null,null,4]
[null,2,"G",null,null,null,null,null,"R30109","15;L:24;28",null,null,null,5,null,null,null,null,null,null,null,null,null,null,null,null,null,null,null,null,null,null,null,null,null,null,null,null,null,null,null,null,null,null,null,null,null,null,null,null,5]
[null,2,"G",null,null,null,null,null,"R30109","15;L:24;28",null,null,null,6,null,null,null,null,null,null,null,null,null,null,null,null,null,null,null,null,null,null,null,null,null,null,null,null,null,null,null,null,null,null,null,null,null,null,null,null,6]
[null,2,"G",null,null,null,null,null,"R30109","15;L:24;28",null,null,null,7,null,null,null,null,null,null,null,null,null,null,null,null,null,null,null,null,null,null,null,null,null,null,null,null,null,null,null,null,null,null,null,null,null,null,null,null,7]
[null,2,"G",null,null,null,null,null,"R30109","15;L:24;28",null,null,null,8,null,null,null,null,null,null,null,null,null,null,null,null,null,null,null,null,null,null,null,null,null,null,null,null,null,null,null,null,null,null,null,null,null,null,null,null,8]
[null,2,"G",null,null,null,null,null,"R30109","15;L:24;28",null,null,null,9,null,null,null,null,null,null,null,null,null,null,null,null,null,null,null,null,null,null,null,null,null,null,null,null,null,null,null,null,null,null,null,null,null,null,null,null,9]
[null,2,"G",null,null,null,null,null,"R30109","15;L:24;28",null,null,null,10,null,null,null,null,null,null,null,null,null,null,null,null,null,null,null,null,null,null,null,null,null,null,null,null,null,null,null,null,null,null,null,null,null,null,null,null,10]
[null,2,null,null,null,null,null,null,null,null,null,null,null,null,null,null,null,null,null,null,null,null,"Kopā",{"$f":"SUM($X$882:AA891)","v":0},null,null,null,null,null,null,null,null,null,null,null,null,null,null,null,null,null,null,null,null,null,null,null,null,null,null,null,null,null,null,null,null,null,null,null,"Kopā",{"$f":"SUM($BI$882:BL891)","v":0}]
[null,2,{"$f":"C894","v":""}]
[null,2,{"$f":"IF(C895=\"GS\",\"S\",\"\")","v":""},null,null,null,null,null,null,null,null,null,null,"Papildus sniegtā informācija, ja tāda ir",null,null,null,null,null,null,null,null,null,null,null,null,null,null,null,null,null,null,null,null,null,null,null,null,null,null,null,null,null,null,null,null,null,null,null,null,"Papildus sniegtā informācija, ja tāda ir"]
[null,2,{"$f":"IFERROR(IF(OR(N895<>\"\",AY895<>\"\"),\"GS\",\"G\"),\"GS\")","v":"G"},null,"x","x","x",null,"R3010901",{"$f":"COLUMN(N895)","v":14},{"$f":"LEFT(IF(LEN(N895)<LEN(AY895),AY895,N895),LEN(IF(LEN(N895)<LEN(AY895),AY895,N895))/2)","v":""},null,null,null,null,null,null,null,null,null,null,null,null,null,null,null,null,null,null,null,null,null,null,null,null,null,null,null,null,null,null,null,null,null,null,null,null,null,null,null,null,null,null,null,null,null,null,null,null,null,null,null,null,null,null,null,null,null,null,null,null,null,null,null,null,null,null,null,null,null,null,null,null,null,null,null,"x"]
[null,2,{"$f":"C895","v":"G"},null,null,null,null,null,null,{"$f":"COLUMN(N896)","v":14},{"$f":"RIGHT(IF(LEN(N895)<LEN(AY895),AY895,N895),LEN(IF(LEN(N895)<LEN(AY895),AY895,N895))/2)","v":""}]
[null,4,{"$f":"C898","v":""}]
[null,4,{"$f":"IF(COUNTIFS(AS899:AU901,\">0\")>0,\"S\",\"\")","v":""},null,null,null,"x",null,null,null,null,null,null,"3.1.10."," atliktā nodokļa aktīvi: (informācija par bilances posteni \"Atliktā nodokļa aktīvi\")",null,null,null,null,null,null,null,null,null,null,null,null,null,null,null,null,null,null,null,null,null,null,null,null,null,null,null,null,null,"Summa",null,null,null,null,null,"3.1.10."," atliktā nodokļa aktīvi: (informācija par bilances posteni \"Atliktā nodokļa aktīvi\")",null,null,null,null,null,null,null,null,null,null,null,null,null,null,null,null,null,null,null,null,null,null,null,null,null,null,null,null,null,"Summa"]
[null,4,{"$f":"IF(COUNT(AS899:AU900)>0,\"GS\",\"G\")","v":"G"},null,null,null,null,null,"R3011001",{"$f":"\"L:\"&COLUMN(AS899)","v":"L:45"},null,null,null,null,"pārskata gada sākumā",null,null,null,null,null,null,null,null,null,null,null,null,null,null,null,null,null,null,null,null,null,null,null,null,null,null,null,null,null,null,null,null,null,null,null,null,"pārskata gada sākumā"]
[null,4,{"$f":"C899","v":"G"},null,null,null,null,null,"R3011002",{"$f":"\"L:\"&COLUMN(AS900)","v":"L:45"},null,null,null,null,"pārskata gada beigās",null,null,null,null,null,null,null,null,null,null,null,null,null,null,null,null,null,null,null,null,null,null,null,null,null,null,null,null,null,null,null,null,null,null,null,null,"pārskata gada beigās"]
[null,4,{"$f":"C900","v":"G"},null,null,null,null,null,null,null,null,null,null,null,"izmaiņas",null,null,null,null,null,null,null,null,null,null,null,null,null,null,null,null,null,null,null,null,null,null,null,null,null,null,null,null,null,{"$f":"AS899-AS900","v":0},null,null,null,null,null,null,"izmaiņas",null,null,null,null,null,null,null,null,null,null,null,null,null,null,null,null,null,null,null,null,null,null,null,null,null,null,null,null,null,{"$f":"CD899-CD900","v":0}]
[null,1]
[null,1,null,"x","x","x","x",null,null,null,null,null,null,"3.2.","Aizdevumi",null,null,null,null,null,null,null,null,null,null,null,null,null,null,null,null,null,null,null,null,null,null,null,null,null,null,null,null,null,null,null,null,null,null,null,"3.2.","Aizdevumi"]
[null,1,null,"x","x","x","x",null,null,null,null,null,null,"3.2.1.","aizdevumi, galvojumi un izsniegtie avansi akcionāriem vai dalībniekiem un vadībai (padomes un valdes locekļiem)",null,null,null,null,null,null,null,null,null,null,null,null,null,null,null,null,null,null,null,null,null,null,null,null,null,null,null,null,null,null,null,null,null,null,null,"3.2.1.","aizdevumi, galvojumi un izsniegtie avansi akcionāriem vai dalībniekiem un vadībai (padomes un valdes locekļiem)"]
[null,1,null,null,null,null,null,null,null,null,null,null,null,"Ilgtermiņa",null,null,null,null,null,null,null,null,null,null,null,null,null,null,null,null,null,null,null,null,null,null,null,null,null,null,null,null,null,null,null,null,null,null,null,null,"Ilgtermiņa"]
[null,1,null,null,null,null,null,null,null,null,null,null,null,null,"Amatu grupa",null,null,null,null,null,null,null,null,"Izsniegšanas \ndatums",null,null,null,"Izsniegtās summas vai galvojuma apmērs",null,null,null,"Procentu \nlikme",null,null,null,"Atpakaļ saņemtās summas apmērs",null,null,null,"Parāda atlikums pārskata perioda beigās",null,null,null,"Aizdevuma atmaksas datums",null,null,null,null,null,null,null,"Amatu grupa",null,null,null,null,null,null,null,null,"Izsniegšanas \ndatums",null,null,null,"Izsniegtās summas vai galvojuma apmērs",null,null,null,"Procentu \nlikme",null,null,null,"Atpakaļ saņemtās summas apmērs",null,null,null,"Parāda atlikums pārskata perioda beigās",null,null,null,"Aizdevuma atmaksas datums"]
[null,1]
[null,1]
[null,1,{"$f":"IF(C910=\"GS\",\"S\",\"\")","v":""}]
[null,1,{"$f":"IFERROR(IF(OR(O910<>\"\",AZ910<>\"\"),\"GS\",\"G\"),\"GS\")","v":"G"},null,null,null,null,null,"R3020101",{"$f":"COLUMN(O910)&\";DT:\"&COLUMN(X910)&\";N:\"&COLUMN(AB910)&\";N:\"&COLUMN(AF910)&\";N:\"&COLUMN(AJ910)&\";N:\"&COLUMN(AN910)&\";DT:\"&COLUMN(AR910)","v":"15;DT:24;N:28;N:32;N:36;N:40;DT:44"},null,null,null,1,null,null,null,null,null,null,null,null,null,null,null,null,null,null,null,null,null,null,null,null,null,null,null,null,null,null,null,null,null,null,null,null,null,null,null,null,1]
[null,1,"G",null,null,null,null,null,"R3020101","15;DT:24;N:28;N:32;N:36;N:40;DT:44",null,null,null,2,null,null,null,null,null,null,null,null,null,null,null,null,null,null,null,null,null,null,null,null,null,null,null,null,null,null,null,null,null,null,null,null,null,null,null,null,2]
[null,1,"G",null,null,null,null,null,"R3020101","15;DT:24;N:28;N:32;N:36;N:40;DT:44",null,null,null,3,null,null,null,null,null,null,null,null,null,null,null,null,null,null,null,null,null,null,null,null,null,null,null,null,null,null,null,null,null,null,null,null,null,null,null,null,3]
[null,1,"G",null,null,null,null,null,"R3020101","15;DT:24;N:28;N:32;N:36;N:40;DT:44",null,null,null,4,null,null,null,null,null,null,null,null,null,null,null,null,null,null,null,null,null,null,null,null,null,null,null,null,null,null,null,null,null,null,null,null,null,null,null,null,4]
[null,1,"G",null,null,null,null,null,"R3020101","15;DT:24;N:28;N:32;N:36;N:40;DT:44",null,null,null,5,null,null,null,null,null,null,null,null,null,null,null,null,null,null,null,null,null,null,null,null,null,null,null,null,null,null,null,null,null,null,null,null,null,null,null,null,5]
[null,1,"G",null,null,null,null,null,"R3020101","15;DT:24;N:28;N:32;N:36;N:40;DT:44",null,null,null,6,null,null,null,null,null,null,null,null,null,null,null,null,null,null,null,null,null,null,null,null,null,null,null,null,null,null,null,null,null,null,null,null,null,null,null,null,6]
[null,1,"G",null,null,null,null,null,"R3020101","15;DT:24;N:28;N:32;N:36;N:40;DT:44",null,null,null,7,null,null,null,null,null,null,null,null,null,null,null,null,null,null,null,null,null,null,null,null,null,null,null,null,null,null,null,null,null,null,null,null,null,null,null,null,7]
[null,1,"G",null,null,null,null,null,"R3020101","15;DT:24;N:28;N:32;N:36;N:40;DT:44",null,null,null,8,null,null,null,null,null,null,null,null,null,null,null,null,null,null,null,null,null,null,null,null,null,null,null,null,null,null,null,null,null,null,null,null,null,null,null,null,8]
[null,1,"G",null,null,null,null,null,"R3020101","15;DT:24;N:28;N:32;N:36;N:40;DT:44",null,null,null,9,null,null,null,null,null,null,null,null,null,null,null,null,null,null,null,null,null,null,null,null,null,null,null,null,null,null,null,null,null,null,null,null,null,null,null,null,9]
[null,1,"G",null,null,null,null,null,"R3020101","15;DT:24;N:28;N:32;N:36;N:40;DT:44",null,null,null,10,null,null,null,null,null,null,null,null,null,null,null,null,null,null,null,null,null,null,null,null,null,null,null,null,null,null,null,null,null,null,null,null,null,null,null,null,10]
[null,1,null,null,null,null,null,null,null,null,null,null,null,null,null,null,null,null,null,null,null,null,null,null,null,null,"Kopā",{"$f":"SUM(AB910:AE919)","v":0},null,null,null,null,null,null,null,{"$f":"SUM(AJ910:AM919)","v":0},null,null,null,{"$f":"SUM(AN910:AQ919)","v":0},null,null,null,null,null,null,null,null,null,null,null,null,null,null,null,null,null,null,null,null,null,null,null,"Kopā",{"$f":"SUM(BM910:BP919)","v":0},null,null,null,null,null,null,null,{"$f":"SUM(BU910:BX919)","v":0},null,null,null,{"$f":"SUM(BY910:CB919)","v":0}]
[null,1]
[null,1,null,null,null,null,null,null,null,null,null,null,null,"Īstermiņa",null,null,null,null,null,null,null,null,null,null,null,null,null,null,null,null,null,null,null,null,null,null,null,null,null,null,null,null,null,null,null,null,null,null,null,null,"Īstermiņa"]
[null,1,null,null,null,null,null,null,null,null,null,null,null,null,"Amatu grupa",null,null,null,null,null,null,null,null,"Izsniegšanas \ndatums",null,null,null,"Izsniegtās summas vai galvojuma apmērs",null,null,null,"Procentu \nlikme",null,null,null,"Atpakaļ saņemtās summas apmērs",null,null,null,"Parāda atlikums pārskata perioda beigās",null,null,null,"Aizdevuma atmaksas datums",null,null,null,null,null,null,null,"Amatu grupa",null,null,null,null,null,null,null,null,"Izsniegšanas \ndatums",null,null,null,"Izsniegtās summas vai galvojuma apmērs",null,null,null,"Procentu \nlikme",null,null,null,"Atpakaļ saņemtās summas apmērs",null,null,null,"Parāda atlikums pārskata perioda beigās",null,null,null,"Aizdevuma atmaksas datums"]
[null,1]
[null,1]
[null,1,{"$f":"IF(C927=\"GS\",\"S\",\"\")","v":""}]
[null,1,{"$f":"IFERROR(IF(OR(O927<>\"\",AZ927<>\"\"),\"GS\",\"G\"),\"GS\")","v":"G"},null,null,null,null,null,"R3020102",{"$f":"COLUMN(O927)&\";DT:\"&COLUMN(X927)&\";N:\"&COLUMN(AB927)&\";N:\"&COLUMN(AF927)&\";N:\"&COLUMN(AJ927)&\";N:\"&COLUMN(AN927)&\";DT:\"&COLUMN(AR927)","v":"15;DT:24;N:28;N:32;N:36;N:40;DT:44"},null,null,null,1,null,null,null,null,null,null,null,null,null,null,null,null,null,null,null,null,null,null,null,null,null,null,null,null,null,null,null,null,null,null,null,null,null,null,null,null,1]
[null,1,"G",null,null,null,null,null,"R3020102","15;DT:24;N:28;N:32;N:36;N:40;DT:44",null,null,null,2,null,null,null,null,null,null,null,null,null,null,null,null,null,null,null,null,null,null,null,null,null,null,null,null,null,null,null,null,null,null,null,null,null,null,null,null,2]
[null,1,"G",null,null,null,null,null,"R3020102","15;DT:24;N:28;N:32;N:36;N:40;DT:44",null,null,null,3,null,null,null,null,null,null,null,null,null,null,null,null,null,null,null,null,null,null,null,null,null,null,null,null,null,null,null,null,null,null,null,null,null,null,null,null,3]
[null,1,"G",null,null,null,null,null,"R3020102","15;DT:24;N:28;N:32;N:36;N:40;DT:44",null,null,null,4,null,null,null,null,null,null,null,null,null,null,null,null,null,null,null,null,null,null,null,null,null,null,null,null,null,null,null,null,null,null,null,null,null,null,null,null,4]
[null,1,"G",null,null,null,null,null,"R3020102","15;DT:24;N:28;N:32;N:36;N:40;DT:44",null,null,null,5,null,null,null,null,null,null,null,null,null,null,null,null,null,null,null,null,null,null,null,null,null,null,null,null,null,null,null,null,null,null,null,null,null,null,null,null,5]
[null,1,"G",null,null,null,null,null,"R3020102","15;DT:24;N:28;N:32;N:36;N:40;DT:44",null,null,null,6,null,null,null,null,null,null,null,null,null,null,null,null,null,null,null,null,null,null,null,null,null,null,null,null,null,null,null,null,null,null,null,null,null,null,null,null,6]
[null,1,"G",null,null,null,null,null,"R3020102","15;DT:24;N:28;N:32;N:36;N:40;DT:44",null,null,null,7,null,null,null,null,null,null,null,null,null,null,null,null,null,null,null,null,null,null,null,null,null,null,null,null,null,null,null,null,null,null,null,null,null,null,null,null,7]
[null,1,"G",null,null,null,null,null,"R3020102","15;DT:24;N:28;N:32;N:36;N:40;DT:44",null,null,null,8,null,null,null,null,null,null,null,null,null,null,null,null,null,null,null,null,null,null,null,null,null,null,null,null,null,null,null,null,null,null,null,null,null,null,null,null,8]
[null,1,"G",null,null,null,null,null,"R3020102","15;DT:24;N:28;N:32;N:36;N:40;DT:44",null,null,null,9,null,null,null,null,null,null,null,null,null,null,null,null,null,null,null,null,null,null,null,null,null,null,null,null,null,null,null,null,null,null,null,null,null,null,null,null,9]
[null,1,"G",null,null,null,null,null,"R3020102","15;DT:24;N:28;N:32;N:36;N:40;DT:44",null,null,null,10,null,null,null,null,null,null,null,null,null,null,null,null,null,null,null,null,null,null,null,null,null,null,null,null,null,null,null,null,null,null,null,null,null,null,null,null,10]
[null,1,null,null,null,null,null,null,null,null,null,null,null,null,null,null,null,null,null,null,null,null,null,null,null,null,"Kopā",{"$f":"SUM(AB927:AE936)","v":0},null,null,null,null,null,null,null,{"$f":"SUM(AJ927:AM936)","v":0},null,null,null,{"$f":"SUM(AN927:AQ936)","v":0},null,null,null,null,null,null,null,null,null,null,null,null,null,null,null,null,null,null,null,null,null,null,null,"Kopā",{"$f":"SUM(BM927:BP936)","v":0},null,null,null,null,null,null,null,{"$f":"SUM(BU927:BX936)","v":0},null,null,null,{"$f":"SUM(BY927:CB936)","v":0}]
[null,1,{"$f":"C939","v":""}]
[null,1,{"$f":"IF(C940=\"GS\",\"S\",\"\")","v":""},null,null,null,null,null,null,null,null,null,null,"Papildus sniegtā informācija, ja tāda ir",null,null,null,null,null,null,null,null,null,null,null,null,null,null,null,null,null,null,null,null,null,null,null,null,null,null,null,null,null,null,null,null,null,null,null,null,"Papildus sniegtā informācija, ja tāda ir"]
[null,1,{"$f":"IFERROR(IF(OR(N940<>\"\",AY940<>\"\"),\"GS\",\"G\"),\"GS\")","v":"G"},"x","x","x","x",null,"R3020103",{"$f":"COLUMN(N940)","v":14},{"$f":"LEFT(IF(LEN(N940)<LEN(AY940),AY940,N940),LEN(IF(LEN(N940)<LEN(AY940),AY940,N940))/2)","v":""}]
[null,1,{"$f":"C940","v":"G"},null,null,null,null,null,null,{"$f":"COLUMN(N941)","v":14},{"$f":"RIGHT(IF(LEN(N940)<LEN(AY940),AY940,N940),LEN(IF(LEN(N940)<LEN(AY940),AY940,N940))/2)","v":""}]
[null,1,{"$f":"C943","v":""}]
[null,4,{"$f":"IF(C944=\"GS\",\"S\",\"\")","v":""},null,null,null,"x",null,null,null,null,null,null,"3.2.2.","priekšlikumi vai informācija par peļņas sadali vai zaudējumu segšanu",null,null,null,null,null,null,null,null,null,null,null,null,null,null,null,null,null,null,null,null,null,null,null,null,null,null,null,null,null,null,null,null,null,null,null,"3.2.2.","priekšlikumi vai informācija par peļņas sadali vai zaudējumu segšanu"]
[null,4,{"$f":"IFERROR(IF(OR(N944<>\"\",AY944<>\"\"),\"GS\",\"G\"),\"GS\")","v":"G"},null,null,null,null,null,"R30202",{"$f":"COLUMN(N944)","v":14},{"$f":"LEFT(IF(LEN(N944)<LEN(AY944),AY944,N944),LEN(IF(LEN(N944)<LEN(AY944),AY944,N944))/2)","v":""},null,null,null,null,null,null,null,null,null,null,null,null,null,null,null,null,null,null,null,null,null,null,null,null,null,null,null,null,null,null,null,null,null,null,null,null,null,null,null,null,null,null,null,null,null,null,null,null,null,null,null,null,null,null,null,null,null,null,null,null,null,null,null,null,null,null,null,null,null,null,null,null,null,null,null,{"$f":"N943","v":"3.2.2."}]
[null,4,{"$f":"C944","v":"G"},null,null,null,null,null,null,{"$f":"COLUMN(N945)","v":14},{"$f":"RIGHT(IF(LEN(N944)<LEN(AY944),AY944,N944),LEN(IF(LEN(N944)<LEN(AY944),AY944,N944))/2)","v":""}]
[null,3,{"$f":"C947","v":""}]
[null,3,"",null,null,null,"x",null,null,null,null,null,null,"3.2.3.","ārkārtas dividendes",null,null,null,null,null,null,null,null,null,null,null,null,null,null,null,null,null,null,null,null,null,null,null,null,null,null,null,null,null,null,null,null,null,null,null,"3.2.3.","ārkārtas dividendes"]
[null,3,"",null,null,null,null,null,null,null,null,null,null,null,"Amats",null,null,null,null,null,null,null,null,null,null,null,null,"Aprēķināts",null,null,null,"Izsniegšanas datums",null,null,null,"Izsniegts",null,null,null,"Ārkārtas dividenžu summas pārsnieguma daļa, kas norādīta postenī \"Pārējās saimnieciskās darbības izmaksas\"",null,null,null,null,null,null,null,null,null,null,null,"Amats",null,null,null,null,null,null,null,null,null,null,null,null,"Aprēķināts",null,null,null,"Izsniegšanas datums",null,null,null,"Izsniegts",null,null,null,"Ārkārtas dividenžu summas pārsnieguma daļa, kas norādīta postenī \"Pārējās saimnieciskās darbības izmaksas\""]
[null,3,""]
[null,3,{"$f":"C951","v":""}]
[null,3,{"$f":"IF(C952=\"GS\",\"S\",\"\")","v":""}]
[null,3,{"$f":"IFERROR(IF(OR(O952<>\"\",AZ952<>\"\"),\"GS\",\"G\"),\"GS\")","v":"G"},null,null,null,null,null,"R30203",{"$f":"COLUMN(O952)&\";N:\"&COLUMN(AB952)&\";DT:\"&COLUMN(AF952)&\";N:\"&COLUMN(AJ952)&\";N:\"&COLUMN(AN952)","v":"15;N:28;DT:32;N:36;N:40"},null,null,null,1,null,null,null,null,null,null,null,null,null,null,null,null,null,null,null,null,null,null,null,null,null,null,null,null,null,null,null,null,null,null,null,null,null,null,null,null,1]
[null,3,"G",null,null,null,null,null,"R30203","15;N:28;DT:32;N:36;N:40",null,null,null,2,null,null,null,null,null,null,null,null,null,null,null,null,null,null,null,null,null,null,null,null,null,null,null,null,null,null,null,null,null,null,null,null,null,null,null,null,2]
[null,3,"G",null,null,null,null,null,"R30203","15;N:28;DT:32;N:36;N:40",null,null,null,3,null,null,null,null,null,null,null,null,null,null,null,null,null,null,null,null,null,null,null,null,null,null,null,null,null,null,null,null,null,null,null,null,null,null,null,null,3]
[null,3,"G",null,null,null,null,null,"R30203","15;N:28;DT:32;N:36;N:40",null,null,null,4,null,null,null,null,null,null,null,null,null,null,null,null,null,null,null,null,null,null,null,null,null,null,null,null,null,null,null,null,null,null,null,null,null,null,null,null,4]
[null,3,"G",null,null,null,null,null,"R30203","15;N:28;DT:32;N:36;N:40",null,null,null,5,null,null,null,null,null,null,null,null,null,null,null,null,null,null,null,null,null,null,null,null,null,null,null,null,null,null,null,null,null,null,null,null,null,null,null,null,5]
[null,3,"G",null,null,null,null,null,"R30203","15;N:28;DT:32;N:36;N:40",null,null,null,6,null,null,null,null,null,null,null,null,null,null,null,null,null,null,null,null,null,null,null,null,null,null,null,null,null,null,null,null,null,null,null,null,null,null,null,null,6]
[null,3,"G",null,null,null,null,null,"R30203","15;N:28;DT:32;N:36;N:40",null,null,null,7,null,null,null,null,null,null,null,null,null,null,null,null,null,null,null,null,null,null,null,null,null,null,null,null,null,null,null,null,null,null,null,null,null,null,null,null,7]
[null,3,"G",null,null,null,null,null,"R30203","15;N:28;DT:32;N:36;N:40",null,null,null,8,null,null,null,null,null,null,null,null,null,null,null,null,null,null,null,null,null,null,null,null,null,null,null,null,null,null,null,null,null,null,null,null,null,null,null,null,8]
[null,3,"G",null,null,null,null,null,"R30203","15;N:28;DT:32;N:36;N:40",null,null,null,9,null,null,null,null,null,null,null,null,null,null,null,null,null,null,null,null,null,null,null,null,null,null,null,null,null,null,null,null,null,null,null,null,null,null,null,null,9]
[null,3,"G",null,null,null,null,null,"R30203","15;N:28;DT:32;N:36;N:40",null,null,null,10,null,null,null,null,null,null,null,null,null,null,null,null,null,null,null,null,null,null,null,null,null,null,null,null,null,null,null,null,null,null,null,null,null,null,null,null,10]
[null,3,{"$f":"C951","v":""},null,null,null,null,null,null,null,null,null,null,null,null,null,null,null,null,null,null,null,null,null,null,null,"Kopā",{"$f":"SUM(AB952:AE961)","v":0},null,null,null,null,null,null,null,{"$f":"SUM(AJ952:AM961)","v":0},null,null,null,{"$f":"SUM(AN952:AU961)","v":0},null,null,null,null,null,null,null,null,null,null,null,null,null,null,null,null,null,null,null,null,null,null,null,"Kopā",{"$f":"SUM(BM952:BP961)","v":0},null,null,null,null,null,null,null,{"$f":"SUM(BU952:BX961)","v":0},null,null,null,{"$f":"SUM(BY952:CF961)","v":0}]
[null,3]
[null,3]
[null,3,null,null,null,"x","x",null,null,null,null,null,null,"3.2.4.","pārējie aizdevumi un citi ilgtermiņa debitori",null,null,null,null,null,null,null,null,null,null,null,null,null,null,null,null,null,null,null,null,null,null,null,null,null,null,null,null,null,null,null,null,null,null,null,"3.2.4.","pārējie aizdevumi un citi ilgtermiņa debitori"]
[null,3,null,null,null,null,null,null,null,null,null,null,null,null,"Papildus sniegtā informācija, ja tāda ir",null,null,null,null,null,null,null,null,null,null,null,null,null,null,null,null,null,null,null,null,"Summa pārskata \ngada sākumā",null,null,null,"Izmaiņas pārskata periodā",null,null,null,"Atlikums pārskata perioda beigās",null,null,null,null,null,null,null,"Papildus sniegtā informācija, ja tāda ir",null,null,null,null,null,null,null,null,null,null,null,null,null,null,null,null,null,null,null,null,"Summa pārskata \ngada sākumā",null,null,null,"Izmaiņas pārskata periodā",null,null,null,"Atlikums pārskata perioda beigās"]
[null,3]
[null,3,{"$f":"IF(C969=\"GS\",\"S\",\"\")","v":""}]
[null,3,{"$f":"IFERROR(IF(OR(O969<>\"\",AZ969<>\"\"),\"GS\",\"G\"),\"GS\")","v":"G"},null,null,null,null,null,"R30204",{"$f":"COLUMN(O969)&\";N:\"&COLUMN(AJ969)&\";N:\"&COLUMN(AN969)&\";N:\"&COLUMN(AR969)","v":"15;N:36;N:40;N:44"},null,null,null,1,null,null,null,null,null,null,null,null,null,null,null,null,null,null,null,null,null,null,null,null,null,null,null,null,null,null,null,null,null,null,null,null,null,null,null,null,1]
[null,3,"G",null,null,null,null,null,"R30204","15;N:36;N:40;N:44",null,null,null,2,null,null,null,null,null,null,null,null,null,null,null,null,null,null,null,null,null,null,null,null,null,null,null,null,null,null,null,null,null,null,null,null,null,null,null,null,2]
[null,3,"G",null,null,null,null,null,"R30204","15;N:36;N:40;N:44",null,null,null,3,null,null,null,null,null,null,null,null,null,null,null,null,null,null,null,null,null,null,null,null,null,null,null,null,null,null,null,null,null,null,null,null,null,null,null,null,3]
[null,3,"G",null,null,null,null,null,"R30204","15;N:36;N:40;N:44",null,null,null,4,null,null,null,null,null,null,null,null,null,null,null,null,null,null,null,null,null,null,null,null,null,null,null,null,null,null,null,null,null,null,null,null,null,null,null,null,4]
[null,3,"G",null,null,null,null,null,"R30204","15;N:36;N:40;N:44",null,null,null,5,null,null,null,null,null,null,null,null,null,null,null,null,null,null,null,null,null,null,null,null,null,null,null,null,null,null,null,null,null,null,null,null,null,null,null,null,5]
[null,3,"G",null,null,null,null,null,"R30204","15;N:36;N:40;N:44",null,null,null,6,null,null,null,null,null,null,null,null,null,null,null,null,null,null,null,null,null,null,null,null,null,null,null,null,null,null,null,null,null,null,null,null,null,null,null,null,6]
[null,3,"G",null,null,null,null,null,"R30204","15;N:36;N:40;N:44",null,null,null,7,null,null,null,null,null,null,null,null,null,null,null,null,null,null,null,null,null,null,null,null,null,null,null,null,null,null,null,null,null,null,null,null,null,null,null,null,7]
[null,3,"G",null,null,null,null,null,"R30204","15;N:36;N:40;N:44",null,null,null,8,null,null,null,null,null,null,null,null,null,null,null,null,null,null,null,null,null,null,null,null,null,null,null,null,null,null,null,null,null,null,null,null,null,null,null,null,8]
[null,3,"G",null,null,null,null,null,"R30204","15;N:36;N:40;N:44",null,null,null,9,null,null,null,null,null,null,null,null,null,null,null,null,null,null,null,null,null,null,null,null,null,null,null,null,null,null,null,null,null,null,null,null,null,null,null,null,9]
[null,3,"G",null,null,null,null,null,"R30204","15;N:36;N:40;N:44",null,null,null,10,null,null,null,null,null,null,null,null,null,null,null,null,null,null,null,null,null,null,null,null,null,null,null,null,null,null,null,null,null,null,null,null,null,null,null,null,10]
[null,3,null,null,null,null,null,null,null,null,null,null,null,null,null,null,null,null,null,null,null,null,null,null,null,null,null,null,null,null,null,null,null,null,"Kopā",{"$f":"SUM(AJ969:AM978)","v":0},null,null,null,{"$f":"SUM(AN969:AQ978)","v":0},null,null,null,{"$f":"SUM(AR969:AU978)","v":0},null,null,null,null,null,null,null,null,null,null,null,null,null,null,null,null,null,null,null,null,null,null,null,null,null,null,null,"Kopā",{"$f":"SUM(BU969:BX978)","v":0},null,null,null,{"$f":"SUM(BY969:CB978)","v":0},null,null,null,{"$f":"SUM(CC969:CF978)","v":0}]
[null,3]
[null,3]
[null,3,{"$f":"IF(C983=\"S\",C983,C1000)","v":""},null,null,"x","x",null,null,null,null,null,null,"3.2.5.","aizdevumi radniecīgajām un asociētajām sabiedrībām",null,null,null,null,null,null,null,null,null,null,null,null,null,null,null,null,null,null,null,null,null,null,null,null,null,null,null,null,null,null,null,null,null,null,null,"3.2.5.","aizdevumi radniecīgajām un asociētajām sabiedrībām"]
[null,3,{"$f":"C984","v":""},null,null,"x","x",null,null,null,null,null,null,"3.2.5.1.","radniecīgo sabiedrību parādi (informācija par bilances posteni \"Aizdevumi radniecīgajām sabiedrībām\")",null,null,null,null,null,null,null,null,null,null,null,null,null,null,null,null,null,null,null,null,null,null,null,null,null,null,null,null,null,null,null,null,null,null,null,"3.2.5.1.","radniecīgo sabiedrību parādi (informācija par bilances posteni \"Aizdevumi radniecīgajām sabiedrībām\")"]
[null,3,{"$f":"C985","v":""},null,null,null,null,null,null,null,null,null,null,null,"Papildus sniegtā informācija, ja tāda ir",null,null,null,null,null,null,null,null,null,null,null,null,null,null,null,null,null,null,null,null,"Summa pārskata \ngada sākumā",null,null,null,"Izmaiņas pārskata periodā",null,null,null,"Atlikums pārskata perioda beigās",null,null,null,null,null,null,null,"Papildus sniegtā informācija, ja tāda ir",null,null,null,null,null,null,null,null,null,null,null,null,null,null,null,null,null,null,null,null,"Summa pārskata \ngada sākumā",null,null,null,"Izmaiņas pārskata periodā",null,null,null,"Atlikums pārskata perioda beigās"]
[null,3,{"$f":"C986","v":""}]
[null,3,{"$f":"IF(C987=\"GS\",\"S\",\"\")","v":""}]
[null,3,{"$f":"IFERROR(IF(OR(O987<>\"\",AZ987<>\"\"),\"GS\",\"G\"),\"GS\")","v":"G"},null,null,null,null,null,"R3020501",{"$f":"COLUMN(O987)&\";N:\"&COLUMN(AJ987)&\";N:\"&COLUMN(AN987)&\";N:\"&COLUMN(AR987)","v":"15;N:36;N:40;N:44"},null,null,null,1,null,null,null,null,null,null,null,null,null,null,null,null,null,null,null,null,null,null,null,null,null,null,null,null,null,null,null,null,null,null,null,null,null,null,null,null,1]
[null,3,"G",null,null,null,null,null,"R3020501","15;N:36;N:40;N:44",null,null,null,2,null,null,null,null,null,null,null,null,null,null,null,null,null,null,null,null,null,null,null,null,null,null,null,null,null,null,null,null,null,null,null,null,null,null,null,null,2]
[null,3,"G",null,null,null,null,null,"R3020501","15;N:36;N:40;N:44",null,null,null,3,null,null,null,null,null,null,null,null,null,null,null,null,null,null,null,null,null,null,null,null,null,null,null,null,null,null,null,null,null,null,null,null,null,null,null,null,3]
[null,3,"G",null,null,null,null,null,"R3020501","15;N:36;N:40;N:44",null,null,null,4,null,null,null,null,null,null,null,null,null,null,null,null,null,null,null,null,null,null,null,null,null,null,null,null,null,null,null,null,null,null,null,null,null,null,null,null,4]
[null,3,"G",null,null,null,null,null,"R3020501","15;N:36;N:40;N:44",null,null,null,5,null,null,null,null,null,null,null,null,null,null,null,null,null,null,null,null,null,null,null,null,null,null,null,null,null,null,null,null,null,null,null,null,null,null,null,null,5]
[null,3,"G",null,null,null,null,null,"R3020501","15;N:36;N:40;N:44",null,null,null,6,null,null,null,null,null,null,null,null,null,null,null,null,null,null,null,null,null,null,null,null,null,null,null,null,null,null,null,null,null,null,null,null,null,null,null,null,6]
[null,3,"G",null,null,null,null,null,"R3020501","15;N:36;N:40;N:44",null,null,null,7,null,null,null,null,null,null,null,null,null,null,null,null,null,null,null,null,null,null,null,null,null,null,null,null,null,null,null,null,null,null,null,null,null,null,null,null,7]
[null,3,"G",null,null,null,null,null,"R3020501","15;N:36;N:40;N:44",null,null,null,8,null,null,null,null,null,null,null,null,null,null,null,null,null,null,null,null,null,null,null,null,null,null,null,null,null,null,null,null,null,null,null,null,null,null,null,null,8]
[null,3,"G",null,null,null,null,null,"R3020501","15;N:36;N:40;N:44",null,null,null,9,null,null,null,null,null,null,null,null,null,null,null,null,null,null,null,null,null,null,null,null,null,null,null,null,null,null,null,null,null,null,null,null,null,null,null,null,9]
[null,3,"G",null,null,null,null,null,"R3020501","15;N:36;N:40;N:44",null,null,null,10,null,null,null,null,null,null,null,null,null,null,null,null,null,null,null,null,null,null,null,null,null,null,null,null,null,null,null,null,null,null,null,null,null,null,null,null,10]
[null,3,{"$f":"C986","v":""},null,null,null,null,null,null,null,null,null,null,null,null,null,null,null,null,null,null,null,null,null,null,null,null,null,null,null,null,null,null,null,"Radniecīgo sabiedrību parādi kopā",{"$f":"SUM(AJ987:AM996)","v":0},null,null,null,{"$f":"SUM(AN987:AQ996)","v":0},null,null,null,{"$f":"SUM(AR987:AU996)","v":0},null,null,null,null,null,null,null,null,null,null,null,null,null,null,null,null,null,null,null,null,null,null,null,null,null,null,null,"Radniecīgo sabiedrību parādi kopā",{"$f":"SUM(BU987:BX996)","v":0},null,null,null,{"$f":"SUM(BY987:CB996)","v":0},null,null,null,{"$f":"SUM(CC987:CF996)","v":0}]
[null,3,{"$f":"C997","v":""}]
[null,3,{"$f":"C1000","v":""}]
[null,3,{"$f":"C1001","v":""},null,null,"x","x",null,null,null,null,null,null,"3.2.5.2.","asociēto sabiedrību parādi (informācija par bilances posteni \"Aizdevumi asociētajām sabiedrībām\")",null,null,null,null,null,null,null,null,null,null,null,null,null,null,null,null,null,null,null,null,null,null,null,null,null,null,null,null,null,null,null,null,null,null,null,"3.2.5.2.","asociēto sabiedrību parādi (informācija par bilances posteni \"Aizdevumi asociētajām sabiedrībām\")"]
[null,3,{"$f":"C1002","v":""},null,null,null,null,null,null,null,null,null,null,null,"Papildus sniegtā informācija, ja tāda ir",null,null,null,null,null,null,null,null,null,null,null,null,null,null,null,null,null,null,null,null,"Summa pārskata \ngada sākumā",null,null,null,"Izmaiņas pārskata periodā",null,null,null,"Atlikums pārskata perioda beigās",null,null,null,null,null,null,null,"Papildus sniegtā informācija, ja tāda ir",null,null,null,null,null,null,null,null,null,null,null,null,null,null,null,null,null,null,null,null,"Summa pārskata \ngada sākumā",null,null,null,"Izmaiņas pārskata periodā",null,null,null,"Atlikums pārskata perioda beigās"]
[null,3,{"$f":"C1003","v":""}]
[null,3,{"$f":"IF(C1004=\"GS\",\"S\",\"\")","v":""}]
[null,3,{"$f":"IFERROR(IF(OR(O1004<>\"\",AZ1004<>\"\"),\"GS\",\"G\"),\"GS\")","v":"G"},null,null,null,null,null,"R3020502",{"$f":"COLUMN(O1004)&\";N:\"&COLUMN(AJ1004)&\";N:\"&COLUMN(AN1004)&\";N:\"&COLUMN(AR1004)","v":"15;N:36;N:40;N:44"},null,null,null,1,null,null,null,null,null,null,null,null,null,null,null,null,null,null,null,null,null,null,null,null,null,null,null,null,null,null,null,null,null,null,null,null,null,null,null,null,1]
[null,3,"G",null,null,null,null,null,"R3020502","15;N:36;N:40;N:44",null,null,null,2,null,null,null,null,null,null,null,null,null,null,null,null,null,null,null,null,null,null,null,null,null,null,null,null,null,null,null,null,null,null,null,null,null,null,null,null,2]
[null,3,"G",null,null,null,null,null,"R3020502","15;N:36;N:40;N:44",null,null,null,3,null,null,null,null,null,null,null,null,null,null,null,null,null,null,null,null,null,null,null,null,null,null,null,null,null,null,null,null,null,null,null,null,null,null,null,null,3]
[null,3,"G",null,null,null,null,null,"R3020502","15;N:36;N:40;N:44",null,null,null,4,null,null,null,null,null,null,null,null,null,null,null,null,null,null,null,null,null,null,null,null,null,null,null,null,null,null,null,null,null,null,null,null,null,null,null,null,4]
[null,3,"G",null,null,null,null,null,"R3020502","15;N:36;N:40;N:44",null,null,null,5,null,null,null,null,null,null,null,null,null,null,null,null,null,null,null,null,null,null,null,null,null,null,null,null,null,null,null,null,null,null,null,null,null,null,null,null,5]
[null,3,"G",null,null,null,null,null,"R3020502","15;N:36;N:40;N:44",null,null,null,6,null,null,null,null,null,null,null,null,null,null,null,null,null,null,null,null,null,null,null,null,null,null,null,null,null,null,null,null,null,null,null,null,null,null,null,null,6]
[null,3,"G",null,null,null,null,null,"R3020502","15;N:36;N:40;N:44",null,null,null,7,null,null,null,null,null,null,null,null,null,null,null,null,null,null,null,null,null,null,null,null,null,null,null,null,null,null,null,null,null,null,null,null,null,null,null,null,7]
[null,3,"G",null,null,null,null,null,"R3020502","15;N:36;N:40;N:44",null,null,null,8,null,null,null,null,null,null,null,null,null,null,null,null,null,null,null,null,null,null,null,null,null,null,null,null,null,null,null,null,null,null,null,null,null,null,null,null,8]
[null,3,"G",null,null,null,null,null,"R3020502","15;N:36;N:40;N:44",null,null,null,9,null,null,null,null,null,null,null,null,null,null,null,null,null,null,null,null,null,null,null,null,null,null,null,null,null,null,null,null,null,null,null,null,null,null,null,null,9]
[null,3,"G",null,null,null,null,null,"R3020502","15;N:36;N:40;N:44",null,null,null,10,null,null,null,null,null,null,null,null,null,null,null,null,null,null,null,null,null,null,null,null,null,null,null,null,null,null,null,null,null,null,null,null,null,null,null,null,10]
[null,3,{"$f":"C1003","v":""},null,null,null,null,null,null,null,null,null,null,null,null,null,null,null,null,null,null,null,null,null,null,null,null,null,null,null,null,null,null,null,"Asociēto sabiedrību parādi kopā",{"$f":"SUM(AJ1004:AM1013)","v":0},null,null,null,{"$f":"SUM(AN1004:AQ1013)","v":0},null,null,null,{"$f":"SUM(AR1004:AU1013)","v":0},null,null,null,null,null,null,null,null,null,null,null,null,null,null,null,null,null,null,null,null,null,null,null,null,null,null,null,"Asociēto sabiedrību parādi kopā",{"$f":"SUM(BU1004:BX1013)","v":0},null,null,null,{"$f":"SUM(BY1004:CB1013)","v":0},null,null,null,{"$f":"SUM(CC1004:CF1013)","v":0}]
[null,3,{"$f":"C1003","v":""}]
[null,3,{"$f":"C1015","v":""}]
[null,1,{"$f":"C1018","v":""},"x","x","x","x",null,null,null,null,null,null,"3.3.","Papildu skaidrojumi par bilances aktīva posteņiem",null,null,null,null,null,null,null,null,null,null,null,null,null,null,null,null,null,null,null,null,null,null,null,null,null,null,null,null,null,null,null,null,null,null,null,"3.3.","Papildu skaidrojumi par bilances aktīva posteņiem"]
[null,2,{"$f":"IF(C1019=\"GS\",\"S\",\"\")","v":""},null,"x","x","x",null,null,null,null,null,null,"3.3.1.","paskaidrojums, ja kāds aktīvu objekts attiecas uz vairākiem bilances shēmas posteņiem",null,null,null,null,null,null,null,null,null,null,null,null,null,null,null,null,null,null,null,null,null,null,null,null,null,null,null,null,null,null,null,null,null,null,null,"3.3.1.","paskaidrojums, ja kāds aktīvu objekts attiecas uz vairākiem bilances shēmas posteņiem"]
[null,2,{"$f":"IFERROR(IF(OR(N1019<>\"\",AY1019<>\"\"),\"GS\",\"G\"),\"GS\")","v":"G"},null,null,null,null,null,"R30301",{"$f":"COLUMN(N1019)","v":14},{"$f":"LEFT(IF(LEN(N1019)<LEN(AY1019),AY1019,N1019),LEN(IF(LEN(N1019)<LEN(AY1019),AY1019,N1019))/2)","v":""},null,null,null,null,null,null,null,null,null,null,null,null,null,null,null,null,null,null,null,null,null,null,null,null,null,null,null,null,null,null,null,null,null,null,null,null,null,null,null,null,null,null,null,null,null,null,null,null,null,null,null,null,null,null,null,null,null,null,null,null,null,null,null,null,null,null,null,null,null,null,null,null,null,null,null,{"$f":"N1018","v":"3.3.1."}]
[null,2,{"$f":"C1019","v":"G"},null,null,null,null,null,null,{"$f":"COLUMN(N1020)","v":14},{"$f":"RIGHT(IF(LEN(N1019)<LEN(AY1019),AY1019,N1019),LEN(IF(LEN(N1019)<LEN(AY1019),AY1019,N1019))/2)","v":""}]
[null,1,{"$f":"C1022","v":""}]
[null,1,{"$f":"IF(C1023=\"GS\",\"S\",\"\")","v":""},"x","x","x","x",null,null,null,null,null,null,"3.3.2.","informācija par ilgtermiņa ieguldījumu vai apgrozāmo līdzekļu ražošanas pašizmaksā iekļauto procentu apmēru",null,null,null,null,null,null,null,null,null,null,null,null,null,null,null,null,null,null,null,null,null,null,null,null,null,null,null,null,null,null,null,null,null,null,null,"3.3.2.","informācija par ilgtermiņa ieguldījumu vai apgrozāmo līdzekļu ražošanas pašizmaksā iekļauto procentu apmēru"]
[null,1,{"$f":"IFERROR(IF(OR(N1023<>\"\",AY1023<>\"\"),\"GS\",\"G\"),\"GS\")","v":"G"},null,null,null,null,null,"R30302",{"$f":"COLUMN(N1023)","v":14},{"$f":"LEFT(IF(LEN(N1023)<LEN(AY1023),AY1023,N1023),LEN(IF(LEN(N1023)<LEN(AY1023),AY1023,N1023))/2)","v":""},null,null,null,null,null,null,null,null,null,null,null,null,null,null,null,null,null,null,null,null,null,null,null,null,null,null,null,null,null,null,null,null,null,null,null,null,null,null,null,null,null,null,null,null,null,null,null,null,null,null,null,null,null,null,null,null,null,null,null,null,null,null,null,null,null,null,null,null,null,null,null,null,null,null,null,{"$f":"N1022","v":"3.3.2."}]
[null,1,{"$f":"C1023","v":"G"},null,null,null,null,null,null,{"$f":"COLUMN(N1024)","v":14},{"$f":"RIGHT(IF(LEN(N1023)<LEN(AY1023),AY1023,N1023),LEN(IF(LEN(N1023)<LEN(AY1023),AY1023,N1023))/2)","v":""}]
[null,1,{"$f":"C1026","v":""}]
[null,1,{"$f":"IF(C1027=\"GS\",\"S\",\"\")","v":""},"x","x","x","x",null,null,null,null,null,null,"3.3.3.","papildinformācija par bilances aktīva posteņiem, ja tāda nepieciešama patiesa un skaidra priekšstata gūšanai",null,null,null,null,null,null,null,null,null,null,null,null,null,null,null,null,null,null,null,null,null,null,null,null,null,null,null,null,null,null,null,null,null,null,null,"3.3.3.","papildinformācija par bilances aktīva posteņiem, ja tāda nepieciešama patiesa un skaidra priekšstata gūšanai"]
[null,1,{"$f":"IFERROR(IF(OR(N1027<>\"\",AY1027<>\"\"),\"GS\",\"G\"),\"GS\")","v":"G"},null,null,null,null,null,"R30303",{"$f":"COLUMN(N1027)","v":14},{"$f":"LEFT(IF(LEN(N1027)<LEN(AY1027),AY1027,N1027),LEN(IF(LEN(N1027)<LEN(AY1027),AY1027,N1027))/2)","v":""},null,null,null,null,null,null,null,null,null,null,null,null,null,null,null,null,null,null,null,null,null,null,null,null,null,null,null,null,null,null,null,null,null,null,null,null,null,null,null,null,null,null,null,null,null,null,null,null,null,null,null,null,null,null,null,null,null,null,null,null,null,null,null,null,null,null,null,null,null,null,null,null,null,null,null,{"$f":"N1026","v":"3.3.3."}]
[null,1,{"$f":"C1027","v":"G"},null,null,null,null,null,null,{"$f":"COLUMN(N1028)","v":14},{"$f":"RIGHT(IF(LEN(N1027)<LEN(AY1027),AY1027,N1027),LEN(IF(LEN(N1027)<LEN(AY1027),AY1027,N1027))/2)","v":""}]
[null,2]
[null,2,null,null,"x","x","x",null,null,null,null,null,null,"4.","Skaidrojums par bilances posteņiem. Pasīvs",null,null,null,null,null,null,null,null,null,null,null,null,null,null,null,null,null,null,null,null,null,null,null,null,null,null,null,null,null,null,null,null,null,null,null,"4.","Skaidrojums par bilances posteņiem. Pasīvs"]
[null,3,{"$f":"C1032","v":""}]
[null,3,"",null,null,null,"x",null,null,null,null,null,null,"4.1.","Informācija par akcijām un daļām (jānorāda pa veidiem, ja pamatkapitāls sastāv no vairāku veidu akcijām vai daļām)",null,null,null,null,null,null,null,null,null,null,null,null,null,null,null,null,null,null,null,null,null,null,null,null,null,null,null,null,null,null,null,null,null,null,null,"4.1.","Informācija par akcijām un daļām (jānorāda pa veidiem, ja pamatkapitāls sastāv no vairāku veidu akcijām vai daļām)"]
[null,3,{"$f":"C1034","v":""},null,null,null,null,null,null,null,null,null,null,null,"Akciju vai daļu veids",null,null,null,null,null,null,null,null,null,null,null,null,null,null,null,null,null,null,null,null,"Skaits",null,null,null,"Nomināl-vērtība",null,null,null,"Uzskaites vērtība \n(ja nominālvērtība nav noteikta)",null,null,null,null,null,null,null,"Akciju vai daļu veids",null,null,null,null,null,null,null,null,null,null,null,null,null,null,null,null,null,null,null,null,"Skaits",null,null,null,"Nomināl-vērtība",null,null,null,"Uzskaites vērtība \n(ja nominālvērtība nav noteikta)"]
[null,3,{"$f":"C1035","v":""}]
[null,3,{"$f":"IF(C1036=\"GS\",\"S\",\"\")","v":""}]
[null,3,{"$f":"IFERROR(IF(OR(O1036<>\"\",AZ1036<>\"\"),\"GS\",\"G\"),\"GS\")","v":"G"},null,null,null,null,null,"R401",{"$f":"COLUMN(O1036)&\";L:\"&COLUMN(AJ1036)&\";N:\"&COLUMN(AN1036)&\";N:\"&COLUMN(AR1036)","v":"15;L:36;N:40;N:44"},null,null,null,1,null,null,null,null,null,null,null,null,null,null,null,null,null,null,null,null,null,null,null,null,null,null,null,null,null,null,null,null,null,null,null,null,null,null,null,null,1]
[null,3,"G",null,null,null,null,null,"R401",{"$f":"COLUMN(O1037)&\";L:\"&COLUMN(AJ1037)&\";N:\"&COLUMN(AN1037)&\";N:\"&COLUMN(AR1037)","v":"15;L:36;N:40;N:44"},null,null,null,2,null,null,null,null,null,null,null,null,null,null,null,null,null,null,null,null,null,null,null,null,null,null,null,null,null,null,null,null,null,null,null,null,null,null,null,null,2]
[null,3,"G",null,null,null,null,null,"R401","15;L:36;N:40;N:44",null,null,null,3,null,null,null,null,null,null,null,null,null,null,null,null,null,null,null,null,null,null,null,null,null,null,null,null,null,null,null,null,null,null,null,null,null,null,null,null,3]
[null,3,"G",null,null,null,null,null,"R401","15;L:36;N:40;N:44",null,null,null,4,null,null,null,null,null,null,null,null,null,null,null,null,null,null,null,null,null,null,null,null,null,null,null,null,null,null,null,null,null,null,null,null,null,null,null,null,4]
[null,3,"G",null,null,null,null,null,"R401","15;L:36;N:40;N:44",null,null,null,5,null,null,null,null,null,null,null,null,null,null,null,null,null,null,null,null,null,null,null,null,null,null,null,null,null,null,null,null,null,null,null,null,null,null,null,null,5]
[null,3,"G",null,null,null,null,null,"R401","15;L:36;N:40;N:44",null,null,null,6,null,null,null,null,null,null,null,null,null,null,null,null,null,null,null,null,null,null,null,null,null,null,null,null,null,null,null,null,null,null,null,null,null,null,null,null,6]
[null,3,"G",null,null,null,null,null,"R401","15;L:36;N:40;N:44",null,null,null,7,null,null,null,null,null,null,null,null,null,null,null,null,null,null,null,null,null,null,null,null,null,null,null,null,null,null,null,null,null,null,null,null,null,null,null,null,7]
[null,3,"G",null,null,null,null,null,"R401","15;L:36;N:40;N:44",null,null,null,8,null,null,null,null,null,null,null,null,null,null,null,null,null,null,null,null,null,null,null,null,null,null,null,null,null,null,null,null,null,null,null,null,null,null,null,null,8]
[null,3,"G",null,null,null,null,null,"R401","15;L:36;N:40;N:44",null,null,null,9,null,null,null,null,null,null,null,null,null,null,null,null,null,null,null,null,null,null,null,null,null,null,null,null,null,null,null,null,null,null,null,null,null,null,null,null,9]
[null,3,"G",null,null,null,null,null,"R401","15;L:36;N:40;N:44",null,null,null,10,null,null,null,null,null,null,null,null,null,null,null,null,null,null,null,null,null,null,null,null,null,null,null,null,null,null,null,null,null,null,null,null,null,null,null,null,10]
[null,3,{"$f":"C1035","v":""},null,null,null,null,null,null,null,null,null,null,null,null,null,null,null,null,null,null,null,null,null,null,null,null,null,null,null,null,null,null,null,"Kopā",{"$f":"SUM(AJ1036:AM1045)","v":0},null,null,null,{"$f":"SUM(AN1036:AQ1045)","v":0},null,null,null,{"$f":"SUM(AR1036:AU1045)","v":0},null,null,null,null,null,null,null,null,null,null,null,null,null,null,null,null,null,null,null,null,null,null,null,null,null,null,null,"Kopā",{"$f":"SUM(BU1036:BX1045)","v":0},null,null,null,{"$f":"SUM(BY1036:CB1045)","v":0},null,null,null,{"$f":"SUM(CC1036:CF1045)","v":0}]
[null,3,{"$f":"C1048","v":""}]
[null,3,{"$f":"IF(C1049=\"GS\",\"S\",\"\")","v":""},null,null,null,null,null,null,null,null,null,null,"Papildus sniegtā informācija, ja tāda ir",null,null,null,null,null,null,null,null,null,null,null,null,null,null,null,null,null,null,null,null,null,null,null,null,null,null,null,null,null,null,null,null,null,null,null,null,"Papildus sniegtā informācija, ja tāda ir"]
[null,3,{"$f":"IFERROR(IF(OR(N1049<>\"\",AY1049<>\"\"),\"GS\",\"G\"),\"GS\")","v":"G"},null,null,null,null,null,"R40101",{"$f":"COLUMN(N1049)","v":14},{"$f":"LEFT(IF(LEN(N1049)<LEN(AY1049),AY1049,N1049),LEN(IF(LEN(N1049)<LEN(AY1049),AY1049,N1049))/2)","v":""},null,null,null,null,null,null,null,null,null,null,null,null,null,null,null,null,null,null,null,null,null,null,null,null,null,null,null,null,null,null,null,null,null,null,null,null,null,null,null,null,null,null,null,null,null,null,null,null,null,null,null,null,null,null,null,null,null,null,null,null,null,null,null,null,null,null,null,null,null,null,null,null,null,null,null,"x"]
[null,3,{"$f":"C1049","v":"G"},null,null,null,null,null,null,{"$f":"COLUMN(N1050)","v":14},{"$f":"RIGHT(IF(LEN(N1049)<LEN(AY1049),AY1049,N1049),LEN(IF(LEN(N1049)<LEN(AY1049),AY1049,N1049))/2)","v":""}]
[null,2]
[null,2,null,null,"x","x","x",null,null,null,null,null,null,"4.2.","Posteņa \"Ilgtermiņa ieguldījumu pārvērtēšanas rezerve\"",null,null,null,null,null,null,null,null,null,null,null,null,null,null,null,null,null,null,null,null,null,null,null,null,null,null,null,null,null,null,null,null,null,null,null,"4.2.","Posteņa \"Ilgtermiņa ieguldījumu pārvērtēšanas rezerve\""]
[null,2,null,null,"x","x","x",null,null,null,null,null,null,"Nekustamie īpašumi",null,null,null,null,null,null,null,null,null,null,null,null,null,null,null,null,null,null,null,null,null,null,null,null,null,null,null,null,null,null,null,null,null,null,null,null,"Nekustamie īpašumi"]
[null,2,null,null,null,null,null,null,null,null,null,null,null,null," \tPamatlīdzekļu grupa vai postenis (var norādīt par katru ilgtermiņa ieguldījumu objektu)",null,null,null,null,null,null,null,null,"Posteņa \"Ilgtermiņa ieguldījumu pārvērtēšanas rezerve\" vērtība pārskata perioda sākumā",null,null,null,"Posteņa \"Ilgtermiņa ieguldījumu pārvērtēšanas rezerve\" vērtība pārskata perioda beigās",null,null,null,"Pamatlīdzekļu vērtība perioda sākumā",null,null,null,"Pamatlīdzekļu pārvērtēšanas rezerves samazinājuma korekcijas",null,null,null,"Pamatlīdzekļu vērtība perioda beigās, ja pārvērtēšana nebūtu veikta",null,null,null,"Pamatlīdzekļu vērtība perioda beigās, kad pārvērtēšana veikta",null,null,null,null,null,null,null," \tPamatlīdzekļu grupa vai postenis (var norādīt par katru ilgtermiņa ieguldījumu objektu)",null,null,null,null,null,null,null,null,"Posteņa \"Ilgtermiņa ieguldījumu pārvērtēšanas rezerve\" vērtība pārskata perioda sākumā",null,null,null,"Posteņa \"Ilgtermiņa ieguldījumu pārvērtēšanas rezerve\" vērtība pārskata perioda beigās",null,null,null,"Pamatlīdzekļu vērtība perioda sākumā",null,null,null,"Pamatlīdzekļu pārvērtēšanas rezerves samazinājuma korekcijas",null,null,null,"Pamatlīdzekļu vērtība perioda beigās, ja pārvērtēšana nebūtu veikta",null,null,null,"Pamatlīdzekļu vērtība perioda beigās, kad pārvērtēšana veikta"]
[null,2]
[null,2]
[null,2]
[null,2]
[null,2,{"$f":"IF(C1060=\"GS\",\"S\",\"\")","v":""}]
[null,2,{"$f":"IFERROR(IF(OR(O1060<>\"\",AZ1060<>\"\"),\"GS\",\"G\"),\"GS\")","v":"G"},null,null,null,null,null,"R40201",{"$f":"COLUMN(O1060)&\";L:\"&COLUMN(X1060)&\";L:\"&COLUMN(AB1060)&\";L:\"&COLUMN(AF1060)&\";L:\"&COLUMN(AJ1060)&\";L:\"&COLUMN(AN1060)&\";L:\"&COLUMN(AR1060)","v":"15;L:24;L:28;L:32;L:36;L:40;L:44"},null,null,null,1,null,null,null,null,null,null,null,null,null,null,null,null,null,null,null,null,null,null,null,null,null,null,null,null,null,null,null,null,null,null,null,null,null,null,null,null,1]
[null,2,"G",null,null,null,null,null,"R40201","15;L:24;L:28;L:32;L:36;L:40;L:44",null,null,null,2,null,null,null,null,null,null,null,null,null,null,null,null,null,null,null,null,null,null,null,null,null,null,null,null,null,null,null,null,null,null,null,null,null,null,null,null,2]
[null,2,"G",null,null,null,null,null,"R40201","15;L:24;L:28;L:32;L:36;L:40;L:44",null,null,null,3,null,null,null,null,null,null,null,null,null,null,null,null,null,null,null,null,null,null,null,null,null,null,null,null,null,null,null,null,null,null,null,null,null,null,null,null,3]
[null,2,"G",null,null,null,null,null,"R40201","15;L:24;L:28;L:32;L:36;L:40;L:44",null,null,null,4,null,null,null,null,null,null,null,null,null,null,null,null,null,null,null,null,null,null,null,null,null,null,null,null,null,null,null,null,null,null,null,null,null,null,null,null,4]
[null,2,"G",null,null,null,null,null,"R40201","15;L:24;L:28;L:32;L:36;L:40;L:44",null,null,null,5,null,null,null,null,null,null,null,null,null,null,null,null,null,null,null,null,null,null,null,null,null,null,null,null,null,null,null,null,null,null,null,null,null,null,null,null,5]
[null,2,"G",null,null,null,null,null,"R40201","15;L:24;L:28;L:32;L:36;L:40;L:44",null,null,null,6,null,null,null,null,null,null,null,null,null,null,null,null,null,null,null,null,null,null,null,null,null,null,null,null,null,null,null,null,null,null,null,null,null,null,null,null,6]
[null,2,"G",null,null,null,null,null,"R40201","15;L:24;L:28;L:32;L:36;L:40;L:44",null,null,null,7,null,null,null,null,null,null,null,null,null,null,null,null,null,null,null,null,null,null,null,null,null,null,null,null,null,null,null,null,null,null,null,null,null,null,null,null,7]
[null,2,"G",null,null,null,null,null,"R40201","15;L:24;L:28;L:32;L:36;L:40;L:44",null,null,null,8,null,null,null,null,null,null,null,null,null,null,null,null,null,null,null,null,null,null,null,null,null,null,null,null,null,null,null,null,null,null,null,null,null,null,null,null,8]
[null,2,"G",null,null,null,null,null,"R40201","15;L:24;L:28;L:32;L:36;L:40;L:44",null,null,null,9,null,null,null,null,null,null,null,null,null,null,null,null,null,null,null,null,null,null,null,null,null,null,null,null,null,null,null,null,null,null,null,null,null,null,null,null,9]
[null,2,"G",null,null,null,null,null,"R40201","15;L:24;L:28;L:32;L:36;L:40;L:44",null,null,null,10,null,null,null,null,null,null,null,null,null,null,null,null,null,null,null,null,null,null,null,null,null,null,null,null,null,null,null,null,null,null,null,null,null,null,null,null,10]
[null,2,null,null,null,null,null,null,null,null,null,null,null,null,null,null,null,null,null,null,null,null,"Nekustamie īpašumi kopā",{"$f":"SUM(X1060:AA1069)","v":0},null,null,null,{"$f":"SUM(AB1060:AE1069)","v":0},null,null,null,{"$f":"SUM(AF1060:AI1069)","v":0},null,null,null,{"$f":"SUM(AJ1060:AM1069)","v":0},null,null,null,{"$f":"SUM(AN1060:AQ1069)","v":0},null,null,null,{"$f":"SUM(AR1060:AU1069)","v":0},null,null,null,null,null,null,null,null,null,null,null,null,null,null,null,"Nekustamie īpašumi kopā",{"$f":"SUM(BI1060:BL1069)","v":0},null,null,null,{"$f":"SUM(BM1060:BP1069)","v":0},null,null,null,{"$f":"SUM(BQ1060:BT1069)","v":0},null,null,null,{"$f":"SUM(BU1060:BX1069)","v":0},null,null,null,{"$f":"SUM(BY1060:CB1069)","v":0},null,null,null,{"$f":"SUM(CC1060:CF1069)","v":0}]
[null,2]
[null,2,null,null,"x","x","x",null,null,null,null,null,null,"Dzīvnieki un augi",null,null,null,null,null,null,null,null,null,null,null,null,null,null,null,null,null,null,null,null,null,null,null,null,null,null,null,null,null,null,null,null,null,null,null,null,"Dzīvnieki un augi"]
[null,2,null,null,null,null,null,null,null,null,null,null,null,null," \tPamatlīdzekļu grupa vai postenis (var norādīt par katru ilgtermiņa ieguldījumu objektu)",null,null,null,null,null,null,null,null,"Posteņa \"Ilgtermiņa ieguldījumu pārvērtēšanas rezerve\" vērtība pārskata perioda sākumā",null,null,null,"Posteņa \"Ilgtermiņa ieguldījumu pārvērtēšanas rezerve\" vērtība pārskata perioda beigās",null,null,null,"Pamatlīdzekļu vērtība perioda sākumā",null,null,null,"Pamatlīdzekļu pārvērtēšanas rezerves samazinājuma korekcijas",null,null,null,"Pamatlīdzekļu vērtība perioda beigās, ja pārvērtēšana nebūtu veikta",null,null,null,"Pamatlīdzekļu vērtība perioda beigās, kad pārvērtēšana veikta",null,null,null,null,null,null,null," \tPamatlīdzekļu grupa vai postenis (var norādīt par katru ilgtermiņa ieguldījumu objektu)",null,null,null,null,null,null,null,null,"Posteņa \"Ilgtermiņa ieguldījumu pārvērtēšanas rezerve\" vērtība pārskata perioda sākumā",null,null,null,"Posteņa \"Ilgtermiņa ieguldījumu pārvērtēšanas rezerve\" vērtība pārskata perioda beigās",null,null,null,"Pamatlīdzekļu vērtība perioda sākumā",null,null,null,"Pamatlīdzekļu pārvērtēšanas rezerves samazinājuma korekcijas",null,null,null,"Pamatlīdzekļu vērtība perioda beigās, ja pārvērtēšana nebūtu veikta",null,null,null,"Pamatlīdzekļu vērtība perioda beigās, kad pārvērtēšana veikta"]
[null,2]
[null,2]
[null,2]
[null,2]
[null,2,{"$f":"IF(C1079=\"GS\",\"S\",\"\")","v":""}]
[null,2,{"$f":"IFERROR(IF(OR(O1079<>\"\",AZ1079<>\"\"),\"GS\",\"G\"),\"GS\")","v":"G"},null,null,null,null,null,"R40202",{"$f":"COLUMN(O1079)&\";L:\"&COLUMN(X1079)&\";L:\"&COLUMN(AB1079)&\";L:\"&COLUMN(AF1079)&\";L:\"&COLUMN(AJ1079)&\";L:\"&COLUMN(AN1079)&\";L:\"&COLUMN(AR1079)","v":"15;L:24;L:28;L:32;L:36;L:40;L:44"},null,null,null,1,null,null,null,null,null,null,null,null,null,null,null,null,null,null,null,null,null,null,null,null,null,null,null,null,null,null,null,null,null,null,null,null,null,null,null,null,1]
[null,2,"G",null,null,null,null,null,"R40202","15;L:24;L:28;L:32;L:36;L:40;L:44",null,null,null,2,null,null,null,null,null,null,null,null,null,null,null,null,null,null,null,null,null,null,null,null,null,null,null,null,null,null,null,null,null,null,null,null,null,null,null,null,2]
[null,2,"G",null,null,null,null,null,"R40202","15;L:24;L:28;L:32;L:36;L:40;L:44",null,null,null,3,null,null,null,null,null,null,null,null,null,null,null,null,null,null,null,null,null,null,null,null,null,null,null,null,null,null,null,null,null,null,null,null,null,null,null,null,3]
[null,2,"G",null,null,null,null,null,"R40202","15;L:24;L:28;L:32;L:36;L:40;L:44",null,null,null,4,null,null,null,null,null,null,null,null,null,null,null,null,null,null,null,null,null,null,null,null,null,null,null,null,null,null,null,null,null,null,null,null,null,null,null,null,4]
[null,2,"G",null,null,null,null,null,"R40202","15;L:24;L:28;L:32;L:36;L:40;L:44",null,null,null,5,null,null,null,null,null,null,null,null,null,null,null,null,null,null,null,null,null,null,null,null,null,null,null,null,null,null,null,null,null,null,null,null,null,null,null,null,5]
[null,2,"G",null,null,null,null,null,"R40202","15;L:24;L:28;L:32;L:36;L:40;L:44",null,null,null,6,null,null,null,null,null,null,null,null,null,null,null,null,null,null,null,null,null,null,null,null,null,null,null,null,null,null,null,null,null,null,null,null,null,null,null,null,6]
[null,2,"G",null,null,null,null,null,"R40202","15;L:24;L:28;L:32;L:36;L:40;L:44",null,null,null,7,null,null,null,null,null,null,null,null,null,null,null,null,null,null,null,null,null,null,null,null,null,null,null,null,null,null,null,null,null,null,null,null,null,null,null,null,7]
[null,2,"G",null,null,null,null,null,"R40202","15;L:24;L:28;L:32;L:36;L:40;L:44",null,null,null,8,null,null,null,null,null,null,null,null,null,null,null,null,null,null,null,null,null,null,null,null,null,null,null,null,null,null,null,null,null,null,null,null,null,null,null,null,8]
[null,2,"G",null,null,null,null,null,"R40202","15;L:24;L:28;L:32;L:36;L:40;L:44",null,null,null,9,null,null,null,null,null,null,null,null,null,null,null,null,null,null,null,null,null,null,null,null,null,null,null,null,null,null,null,null,null,null,null,null,null,null,null,null,9]
[null,2,"G",null,null,null,null,null,"R40202","15;L:24;L:28;L:32;L:36;L:40;L:44",null,null,null,10,null,null,null,null,null,null,null,null,null,null,null,null,null,null,null,null,null,null,null,null,null,null,null,null,null,null,null,null,null,null,null,null,null,null,null,null,10]
[null,2,null,null,null,null,null,null,null,null,null,null,null,null,null,null,null,null,null,null,null,null,"Dzīvnieki un augi kopā",{"$f":"SUM(X1079:AA1088)","v":0},null,null,null,{"$f":"SUM(AB1079:AE1088)","v":0},null,null,null,{"$f":"SUM(AF1079:AI1088)","v":0},null,null,null,{"$f":"SUM(AJ1079:AM1088)","v":0},null,null,null,{"$f":"SUM(AN1079:AQ1088)","v":0},null,null,null,{"$f":"SUM(AR1079:AU1088)","v":0},null,null,null,null,null,null,null,null,null,null,null,null,null,null,null,"Dzīvnieki un augi kopā",{"$f":"SUM(BI1079:BL1088)","v":0},null,null,null,{"$f":"SUM(BM1079:BP1088)","v":0},null,null,null,{"$f":"SUM(BQ1079:BT1088)","v":0},null,null,null,{"$f":"SUM(BU1079:BX1088)","v":0},null,null,null,{"$f":"SUM(BY1079:CB1088)","v":0},null,null,null,{"$f":"SUM(CC1079:CF1088)","v":0}]
[null,2]
[null,2,null,null,"x","x","x",null,null,null,null,null,null,"Tehnoloģiskās iekārtas un ierīces",null,null,null,null,null,null,null,null,null,null,null,null,null,null,null,null,null,null,null,null,null,null,null,null,null,null,null,null,null,null,null,null,null,null,null,null,"Tehnoloģiskās iekārtas un ierīces"]
[null,2,null,null,null,null,null,null,null,null,null,null,null,null," \tPamatlīdzekļu grupa vai postenis (var norādīt par katru ilgtermiņa ieguldījumu objektu)",null,null,null,null,null,null,null,null,"Posteņa \"Ilgtermiņa ieguldījumu pārvērtēšanas rezerve\" vērtība pārskata perioda sākumā",null,null,null,"Posteņa \"Ilgtermiņa ieguldījumu pārvērtēšanas rezerve\" vērtība pārskata perioda beigās",null,null,null,"Pamatlīdzekļu vērtība perioda sākumā",null,null,null,"Pamatlīdzekļu pārvērtēšanas rezerves samazinājuma korekcijas",null,null,null,"Pamatlīdzekļu vērtība perioda beigās, ja pārvērtēšana nebūtu veikta",null,null,null,"Pamatlīdzekļu vērtība perioda beigās, kad pārvērtēšana veikta",null,null,null,null,null,null,null," \tPamatlīdzekļu grupa vai postenis (var norādīt par katru ilgtermiņa ieguldījumu objektu)",null,null,null,null,null,null,null,null,"Posteņa \"Ilgtermiņa ieguldījumu pārvērtēšanas rezerve\" vērtība pārskata perioda sākumā",null,null,null,"Posteņa \"Ilgtermiņa ieguldījumu pārvērtēšanas rezerve\" vērtība pārskata perioda beigās",null,null,null,"Pamatlīdzekļu vērtība perioda sākumā",null,null,null,"Pamatlīdzekļu pārvērtēšanas rezerves samazinājuma korekcijas",null,null,null,"Pamatlīdzekļu vērtība perioda beigās, ja pārvērtēšana nebūtu veikta",null,null,null,"Pamatlīdzekļu vērtība perioda beigās, kad pārvērtēšana veikta"]
[null,2]
[null,2]
[null,2]
[null,2]
[null,2,{"$f":"IF(C1098=\"GS\",\"S\",\"\")","v":""}]
[null,2,{"$f":"IFERROR(IF(OR(O1098<>\"\",AZ1098<>\"\"),\"GS\",\"G\"),\"GS\")","v":"G"},null,null,null,null,null,"R40203",{"$f":"COLUMN(O1098)&\";L:\"&COLUMN(X1098)&\";L:\"&COLUMN(AB1098)&\";L:\"&COLUMN(AF1098)&\";L:\"&COLUMN(AJ1098)&\";L:\"&COLUMN(AN1098)&\";L:\"&COLUMN(AR1098)","v":"15;L:24;L:28;L:32;L:36;L:40;L:44"},null,null,null,1,null,null,null,null,null,null,null,null,null,null,null,null,null,null,null,null,null,null,null,null,null,null,null,null,null,null,null,null,null,null,null,null,null,null,null,null,1]
[null,2,"G",null,null,null,null,null,"R40203","15;L:24;L:28;L:32;L:36;L:40;L:44",null,null,null,2,null,null,null,null,null,null,null,null,null,null,null,null,null,null,null,null,null,null,null,null,null,null,null,null,null,null,null,null,null,null,null,null,null,null,null,null,2]
[null,2,"G",null,null,null,null,null,"R40203","15;L:24;L:28;L:32;L:36;L:40;L:44",null,null,null,3,null,null,null,null,null,null,null,null,null,null,null,null,null,null,null,null,null,null,null,null,null,null,null,null,null,null,null,null,null,null,null,null,null,null,null,null,3]
[null,2,"G",null,null,null,null,null,"R40203","15;L:24;L:28;L:32;L:36;L:40;L:44",null,null,null,4,null,null,null,null,null,null,null,null,null,null,null,null,null,null,null,null,null,null,null,null,null,null,null,null,null,null,null,null,null,null,null,null,null,null,null,null,4]
[null,2,"G",null,null,null,null,null,"R40203","15;L:24;L:28;L:32;L:36;L:40;L:44",null,null,null,5,null,null,null,null,null,null,null,null,null,null,null,null,null,null,null,null,null,null,null,null,null,null,null,null,null,null,null,null,null,null,null,null,null,null,null,null,5]
[null,2,"G",null,null,null,null,null,"R40203","15;L:24;L:28;L:32;L:36;L:40;L:44",null,null,null,6,null,null,null,null,null,null,null,null,null,null,null,null,null,null,null,null,null,null,null,null,null,null,null,null,null,null,null,null,null,null,null,null,null,null,null,null,6]
[null,2,"G",null,null,null,null,null,"R40203","15;L:24;L:28;L:32;L:36;L:40;L:44",null,null,null,7,null,null,null,null,null,null,null,null,null,null,null,null,null,null,null,null,null,null,null,null,null,null,null,null,null,null,null,null,null,null,null,null,null,null,null,null,7]
[null,2,"G",null,null,null,null,null,"R40203","15;L:24;L:28;L:32;L:36;L:40;L:44",null,null,null,8,null,null,null,null,null,null,null,null,null,null,null,null,null,null,null,null,null,null,null,null,null,null,null,null,null,null,null,null,null,null,null,null,null,null,null,null,8]
[null,2,"G",null,null,null,null,null,"R40203","15;L:24;L:28;L:32;L:36;L:40;L:44",null,null,null,9,null,null,null,null,null,null,null,null,null,null,null,null,null,null,null,null,null,null,null,null,null,null,null,null,null,null,null,null,null,null,null,null,null,null,null,null,9]
[null,2,"G",null,null,null,null,null,"R40203","15;L:24;L:28;L:32;L:36;L:40;L:44",null,null,null,10,null,null,null,null,null,null,null,null,null,null,null,null,null,null,null,null,null,null,null,null,null,null,null,null,null,null,null,null,null,null,null,null,null,null,null,null,10]
[null,2,null,null,null,null,null,null,null,null,null,null,null,null,null,null,null,null,null,null,null,null,"Tehnoloģiskās iekārtas un ierīces kopā",{"$f":"SUM(X1098:AA1107)","v":0},null,null,null,{"$f":"SUM(AB1098:AE1107)","v":0},null,null,null,{"$f":"SUM(AF1098:AI1107)","v":0},null,null,null,{"$f":"SUM(AJ1098:AM1107)","v":0},null,null,null,{"$f":"SUM(AN1098:AQ1107)","v":0},null,null,null,{"$f":"SUM(AR1098:AU1107)","v":0},null,null,null,null,null,null,null,null,null,null,null,null,null,null,null,"Tehnoloģiskās iekārtas un ierīces kopā",{"$f":"SUM(BI1098:BL1107)","v":0},null,null,null,{"$f":"SUM(BM1098:BP1107)","v":0},null,null,null,{"$f":"SUM(BQ1098:BT1107)","v":0},null,null,null,{"$f":"SUM(BU1098:BX1107)","v":0},null,null,null,{"$f":"SUM(BY1098:CB1107)","v":0},null,null,null,{"$f":"SUM(CC1098:CF1107)","v":0}]
[null,2]
[null,2,null,null,"x","x","x",null,null,null,null,null,null,"Pārējie pamatlīdzekļi un inventārs",null,null,null,null,null,null,null,null,null,null,null,null,null,null,null,null,null,null,null,null,null,null,null,null,null,null,null,null,null,null,null,null,null,null,null,null,"Pārējie pamatlīdzekļi un inventārs"]
[null,2,null,null,null,null,null,null,null,null,null,null,null,null," \tPamatlīdzekļu grupa vai postenis (var norādīt par katru ilgtermiņa ieguldījumu objektu)",null,null,null,null,null,null,null,null,"Posteņa \"Ilgtermiņa ieguldījumu pārvērtēšanas rezerve\" vērtība pārskata perioda sākumā",null,null,null,"Posteņa \"Ilgtermiņa ieguldījumu pārvērtēšanas rezerve\" vērtība pārskata perioda beigās",null,null,null,"Pamatlīdzekļu vērtība perioda sākumā",null,null,null,"Pamatlīdzekļu pārvērtēšanas rezerves samazinājuma korekcijas",null,null,null,"Pamatlīdzekļu vērtība perioda beigās, ja pārvērtēšana nebūtu veikta",null,null,null,"Pamatlīdzekļu vērtība perioda beigās, kad pārvērtēšana veikta",null,null,null,null,null,null,null," \tPamatlīdzekļu grupa vai postenis (var norādīt par katru ilgtermiņa ieguldījumu objektu)",null,null,null,null,null,null,null,null,"Posteņa \"Ilgtermiņa ieguldījumu pārvērtēšanas rezerve\" vērtība pārskata perioda sākumā",null,null,null,"Posteņa \"Ilgtermiņa ieguldījumu pārvērtēšanas rezerve\" vērtība pārskata perioda beigās",null,null,null,"Pamatlīdzekļu vērtība perioda sākumā",null,null,null,"Pamatlīdzekļu pārvērtēšanas rezerves samazinājuma korekcijas",null,null,null,"Pamatlīdzekļu vērtība perioda beigās, ja pārvērtēšana nebūtu veikta",null,null,null,"Pamatlīdzekļu vērtība perioda beigās, kad pārvērtēšana veikta"]
[null,2]
[null,2]
[null,2]
[null,2]
[null,2,{"$f":"IF(C1117=\"GS\",\"S\",\"\")","v":""}]
[null,2,{"$f":"IFERROR(IF(OR(O1117<>\"\",AZ1117<>\"\"),\"GS\",\"G\"),\"GS\")","v":"G"},null,null,null,null,null,"R40204",{"$f":"COLUMN(O1117)&\";L:\"&COLUMN(X1117)&\";L:\"&COLUMN(AB1117)&\";L:\"&COLUMN(AF1117)&\";L:\"&COLUMN(AJ1117)&\";L:\"&COLUMN(AN1117)&\";L:\"&COLUMN(AR1117)","v":"15;L:24;L:28;L:32;L:36;L:40;L:44"},null,null,null,1,null,null,null,null,null,null,null,null,null,null,null,null,null,null,null,null,null,null,null,null,null,null,null,null,null,null,null,null,null,null,null,null,null,null,null,null,1]
[null,2,"G",null,null,null,null,null,"R40204","15;L:24;L:28;L:32;L:36;L:40;L:44",null,null,null,2,null,null,null,null,null,null,null,null,null,null,null,null,null,null,null,null,null,null,null,null,null,null,null,null,null,null,null,null,null,null,null,null,null,null,null,null,2]
[null,2,"G",null,null,null,null,null,"R40204","15;L:24;L:28;L:32;L:36;L:40;L:44",null,null,null,3,null,null,null,null,null,null,null,null,null,null,null,null,null,null,null,null,null,null,null,null,null,null,null,null,null,null,null,null,null,null,null,null,null,null,null,null,3]
[null,2,"G",null,null,null,null,null,"R40204","15;L:24;L:28;L:32;L:36;L:40;L:44",null,null,null,4,null,null,null,null,null,null,null,null,null,null,null,null,null,null,null,null,null,null,null,null,null,null,null,null,null,null,null,null,null,null,null,null,null,null,null,null,4]
[null,2,"G",null,null,null,null,null,"R40204","15;L:24;L:28;L:32;L:36;L:40;L:44",null,null,null,5,null,null,null,null,null,null,null,null,null,null,null,null,null,null,null,null,null,null,null,null,null,null,null,null,null,null,null,null,null,null,null,null,null,null,null,null,5]
[null,2,"G",null,null,null,null,null,"R40204","15;L:24;L:28;L:32;L:36;L:40;L:44",null,null,null,6,null,null,null,null,null,null,null,null,null,null,null,null,null,null,null,null,null,null,null,null,null,null,null,null,null,null,null,null,null,null,null,null,null,null,null,null,6]
[null,2,"G",null,null,null,null,null,"R40204","15;L:24;L:28;L:32;L:36;L:40;L:44",null,null,null,7,null,null,null,null,null,null,null,null,null,null,null,null,null,null,null,null,null,null,null,null,null,null,null,null,null,null,null,null,null,null,null,null,null,null,null,null,7]
[null,2,"G",null,null,null,null,null,"R40204","15;L:24;L:28;L:32;L:36;L:40;L:44",null,null,null,8,null,null,null,null,null,null,null,null,null,null,null,null,null,null,null,null,null,null,null,null,null,null,null,null,null,null,null,null,null,null,null,null,null,null,null,null,8]
[null,2,"G",null,null,null,null,null,"R40204","15;L:24;L:28;L:32;L:36;L:40;L:44",null,null,null,9,null,null,null,null,null,null,null,null,null,null,null,null,null,null,null,null,null,null,null,null,null,null,null,null,null,null,null,null,null,null,null,null,null,null,null,null,9]
[null,2,"G",null,null,null,null,null,"R40204","15;L:24;L:28;L:32;L:36;L:40;L:44",null,null,null,10,null,null,null,null,null,null,null,null,null,null,null,null,null,null,null,null,null,null,null,null,null,null,null,null,null,null,null,null,null,null,null,null,null,null,null,null,10]
[null,2,null,null,null,null,null,null,null,null,null,null,null,null,null,null,null,null,null,null,null,null,"Pārējie pamatlīdzekļi un inventārs kopā",{"$f":"SUM(X1117:AA1126)","v":0},null,null,null,{"$f":"SUM(AB1117:AE1126)","v":0},null,null,null,{"$f":"SUM(AF1117:AI1126)","v":0},null,null,null,{"$f":"SUM(AJ1117:AM1126)","v":0},null,null,null,{"$f":"SUM(AN1117:AQ1126)","v":0},null,null,null,{"$f":"SUM(AR1117:AU1126)","v":0},null,null,null,null,null,null,null,null,null,null,null,null,null,null,null,"Pārējie pamatlīdzekļi un inventārs kopā",{"$f":"SUM(BI1117:BL1126)","v":0},null,null,null,{"$f":"SUM(BM1117:BP1126)","v":0},null,null,null,{"$f":"SUM(BQ1117:BT1126)","v":0},null,null,null,{"$f":"SUM(BU1117:BX1126)","v":0},null,null,null,{"$f":"SUM(BY1117:CB1126)","v":0},null,null,null,{"$f":"SUM(CC1117:CF1126)","v":0}]
[null,2]
[null,2]
[null,2,null,null,null,null,null,null,null,null,null,null,null,null,null,null,null,null,null,null,null,null,"Pavisam kopā",{"$f":"X1127+X1108+X1089+X1070","v":0},null,null,null,{"$f":"AB1127+AB1108+AB1089+AB1070","v":0},null,null,null,{"$f":"AF1127+AF1108+AF1089+AF1070","v":0},null,null,null,{"$f":"AJ1127+AJ1108+AJ1089+AJ1070","v":0},null,null,null,{"$f":"AN1127+AN1108+AN1089+AN1070","v":0},null,null,null,{"$f":"AR1127+AR1108+AR1089+AR1070","v":0},null,null,null,null,null,null,null,null,null,null,null,null,null,null,null,"Pavisam kopā",{"$f":"BI1127+BI1108+BI1089+BI1070","v":0},null,null,null,{"$f":"BM1127+BM1108+BM1089+BM1070","v":0},null,null,null,{"$f":"BQ1127+BQ1108+BQ1089+BQ1070","v":0},null,null,null,{"$f":"BU1127+BU1108+BU1089+BU1070","v":0},null,null,null,{"$f":"BY1127+BY1108+BY1089+BY1070","v":0},null,null,null,{"$f":"CC1127+CC1108+CC1089+CC1070","v":0}]
[null,2]
[null,2,{"$f":"C1133","v":""}]
[null,2,{"$f":"IF(C1134=\"GS\",\"S\",\"\")","v":""},null,null,null,null,null,null,null,null,null,null,"Paskaidrojums par piemērojamo nodokļu aplikšanas kārtību (ja tāda ir)",null,null,null,null,null,null,null,null,null,null,null,null,null,null,null,null,null,null,null,null,null,null,null,null,null,null,null,null,null,null,null,null,null,null,null,null,"Paskaidrojums par piemērojamo nodokļu aplikšanas kārtību (ja tāda ir)"]
[null,2,{"$f":"IFERROR(IF(OR(N1134<>\"\",AY1134<>\"\"),\"GS\",\"G\"),\"GS\")","v":"G"},null,"x","x","x",null,"R40205",{"$f":"COLUMN(N1134)","v":14},{"$f":"LEFT(IF(LEN(N1134)<LEN(AY1134),AY1134,N1134),LEN(IF(LEN(N1134)<LEN(AY1134),AY1134,N1134))/2)","v":""},null,null,null,null,null,null,null,null,null,null,null,null,null,null,null,null,null,null,null,null,null,null,null,null,null,null,null,null,null,null,null,null,null,null,null,null,null,null,null,null,null,null,null,null,null,null,null,null,null,null,null,null,null,null,null,null,null,null,null,null,null,null,null,null,null,null,null,null,null,null,null,null,null,null,null,"x"]
[null,2,{"$f":"C1134","v":"G"},null,null,null,null,null,null,{"$f":"COLUMN(N1135)","v":14},{"$f":"RIGHT(IF(LEN(N1134)<LEN(AY1134),AY1134,N1134),LEN(IF(LEN(N1134)<LEN(AY1134),AY1134,N1134))/2)","v":""}]
[null,2]
[null,2,null,null,null,null,null,null,null,null,null,null,null,"Paskaidrojums par piemērojamo nodokļu aplikšanas kārtību (ja tāda ir) par katru pārvērtēto pamatlīdzekļu uzskaites grupu",null,null,null,null,null,null,null,null,null,null,null,null,null,null,null,null,null,null,null,null,null,null,null,null,null,null,null,null,null,null,null,null,null,null,null,null,"Paskaidrojums par piemērojamo nodokļu aplikšanas kārtību (ja tāda ir) par katru pārvērtēto pamatlīdzekļu uzskaites grupu"]
[null,2,null,null,"x","x","x",null,null,null,null,null,null,null,"Novērtēšanas \ndatums",null,null,null,null,"Novērtēšanas laikposms (ja visa pamatlīdzekļu grupa tiek pārvērtēta pakāpeniski)",null,null,null,null,null,null,null,null,null,null,null,null,null,null,null,null,null,null,null,null,null,null,null,null,null,null,null,null,null,null,null,"Novērtēšanas \ndatums",null,null,null,null,"Novērtēšanas laikposms (ja visa pamatlīdzekļu grupa tiek pārvērtēta pakāpeniski)"]
[null,2]
[null,2]
[null,2,{"$f":"IF(C1142=\"GS\",\"S\",\"\")","v":""}]
[null,2,{"$f":"IFERROR(IF(OR(O1142<>\"\",AZ1142<>\"\"),\"GS\",\"G\"),\"GS\")","v":"G"},null,null,null,null,null,"R40206",{"$f":"\"DT:\"&COLUMN(O1142)&\";\"&COLUMN(T1142)","v":"DT:15;20"},null,null,null,1,null,null,null,null,null,null,null,null,null,null,null,null,null,null,null,null,null,null,null,null,null,null,null,null,null,null,null,null,null,null,null,null,null,null,null,null,1]
[null,2,"G",null,null,null,null,null,"R40206","DT:15;20",null,null,null,2,null,null,null,null,null,null,null,null,null,null,null,null,null,null,null,null,null,null,null,null,null,null,null,null,null,null,null,null,null,null,null,null,null,null,null,null,2]
[null,2,"G",null,null,null,null,null,"R40206","DT:15;20",null,null,null,3,null,null,null,null,null,null,null,null,null,null,null,null,null,null,null,null,null,null,null,null,null,null,null,null,null,null,null,null,null,null,null,null,null,null,null,null,3]
[null,2,"G",null,null,null,null,null,"R40206","DT:15;20",null,null,null,4,null,null,null,null,null,null,null,null,null,null,null,null,null,null,null,null,null,null,null,null,null,null,null,null,null,null,null,null,null,null,null,null,null,null,null,null,4]
[null,2,"G",null,null,null,null,null,"R40206","DT:15;20",null,null,null,5,null,null,null,null,null,null,null,null,null,null,null,null,null,null,null,null,null,null,null,null,null,null,null,null,null,null,null,null,null,null,null,null,null,null,null,null,5]
[null,2,"G",null,null,null,null,null,"R40206","DT:15;20",null,null,null,6,null,null,null,null,null,null,null,null,null,null,null,null,null,null,null,null,null,null,null,null,null,null,null,null,null,null,null,null,null,null,null,null,null,null,null,null,6]
[null,2,"G",null,null,null,null,null,"R40206","DT:15;20",null,null,null,7,null,null,null,null,null,null,null,null,null,null,null,null,null,null,null,null,null,null,null,null,null,null,null,null,null,null,null,null,null,null,null,null,null,null,null,null,7]
[null,2,"G",null,null,null,null,null,"R40206","DT:15;20",null,null,null,8,null,null,null,null,null,null,null,null,null,null,null,null,null,null,null,null,null,null,null,null,null,null,null,null,null,null,null,null,null,null,null,null,null,null,null,null,8]
[null,2,"G",null,null,null,null,null,"R40206","DT:15;20",null,null,null,9,null,null,null,null,null,null,null,null,null,null,null,null,null,null,null,null,null,null,null,null,null,null,null,null,null,null,null,null,null,null,null,null,null,null,null,null,9]
[null,2,"G",null,null,null,null,null,"R40206","DT:15;20",null,null,null,10,null,null,null,null,null,null,null,null,null,null,null,null,null,null,null,null,null,null,null,null,null,null,null,null,null,null,null,null,null,null,null,null,null,null,null,null,10]
[null,2,{"$f":"C1153","v":"G"}]
[null,2,{"$f":"IFERROR(IF(OR(N1153<>\"\",AY1153<>\"\"),\"GS\",\"G\"),\"GS\")","v":"G"},null,"x","x","x",null,"R4020601",{"$f":"COLUMN(N1153)","v":14},{"$f":"LEFT(IF(LEN(N1153)<LEN(AY1153),AY1153,N1153),LEN(IF(LEN(N1153)<LEN(AY1153),AY1153,N1153))/2)","v":""}]
[null,2,{"$f":"C1153","v":"G"},null,null,null,null,null,null,{"$f":"COLUMN(N1154)","v":14},{"$f":"RIGHT(IF(LEN(N1153)<LEN(AY1153),AY1153,N1153),LEN(IF(LEN(N1153)<LEN(AY1153),AY1153,N1153))/2)","v":""}]
[null,2]
[null,3,null,null,null,"x","x",null,null,null,null,null,null,"4.3.","Posteņa \"Finanšu instrumentu patiesās vērtības rezerve\" vērtības izmaiņas pārskata gadā",null,null,null,null,null,null,null,null,null,null,null,null,null,null,null,null,null,null,null,null,null,null,null,null,null,null,null,null,null,null,null,null,null,null,null,"4.3.","Posteņa \"Finanšu instrumentu patiesās vērtības rezerve\" vērtības izmaiņas pārskata gadā"]
[null,3,null,null,null,null,null,null,null,null,null,null,null,null,"Finanšu instruments",null,null,null,null,null,null,null,null,null,null,null,null,null,null,null,null,null,null,null,null,"Vērtība perioda sākumā",null,null,null,"Vērtība perioda beigās",null,null,null,"Starpība",null,null,null,null,null,null,null,"Finanšu instruments",null,null,null,null,null,null,null,null,null,null,null,null,null,null,null,null,null,null,null,null,"Vērtība perioda sākumā",null,null,null,"Vērtība perioda beigās",null,null,null,"Starpība"]
[null,3,{"$f":"IF(C1159=\"GS\",\"S\",\"\")","v":""}]
[null,3,{"$f":"IFERROR(IF(OR(O1159<>\"\",AZ1159<>\"\"),\"GS\",\"G\"),\"GS\")","v":"G"},null,null,null,null,null,"R403",{"$f":"COLUMN(O1159)&\";L:\"&COLUMN(AJ1159)&\";L:\"&COLUMN(AN1159)&\";L:\"&COLUMN(AR1159)","v":"15;L:36;L:40;L:44"},null,null,null,1,null,null,null,null,null,null,null,null,null,null,null,null,null,null,null,null,null,null,null,null,null,null,null,null,null,null,null,null,null,null,null,null,null,null,null,null,1]
[null,3,"G",null,null,null,null,null,"R403","15;L:36;L:40;L:44",null,null,null,2,null,null,null,null,null,null,null,null,null,null,null,null,null,null,null,null,null,null,null,null,null,null,null,null,null,null,null,null,null,null,null,null,null,null,null,null,2]
[null,3,"G",null,null,null,null,null,"R403","15;L:36;L:40;L:44",null,null,null,3,null,null,null,null,null,null,null,null,null,null,null,null,null,null,null,null,null,null,null,null,null,null,null,null,null,null,null,null,null,null,null,null,null,null,null,null,3]
[null,3,"G",null,null,null,null,null,"R403","15;L:36;L:40;L:44",null,null,null,4,null,null,null,null,null,null,null,null,null,null,null,null,null,null,null,null,null,null,null,null,null,null,null,null,null,null,null,null,null,null,null,null,null,null,null,null,4]
[null,3,"G",null,null,null,null,null,"R403","15;L:36;L:40;L:44",null,null,null,5,null,null,null,null,null,null,null,null,null,null,null,null,null,null,null,null,null,null,null,null,null,null,null,null,null,null,null,null,null,null,null,null,null,null,null,null,5]
[null,3,"G",null,null,null,null,null,"R403","15;L:36;L:40;L:44",null,null,null,6,null,null,null,null,null,null,null,null,null,null,null,null,null,null,null,null,null,null,null,null,null,null,null,null,null,null,null,null,null,null,null,null,null,null,null,null,6]
[null,3,"G",null,null,null,null,null,"R403","15;L:36;L:40;L:44",null,null,null,7,null,null,null,null,null,null,null,null,null,null,null,null,null,null,null,null,null,null,null,null,null,null,null,null,null,null,null,null,null,null,null,null,null,null,null,null,7]
[null,3,"G",null,null,null,null,null,"R403","15;L:36;L:40;L:44",null,null,null,8,null,null,null,null,null,null,null,null,null,null,null,null,null,null,null,null,null,null,null,null,null,null,null,null,null,null,null,null,null,null,null,null,null,null,null,null,8]
[null,3,"G",null,null,null,null,null,"R403","15;L:36;L:40;L:44",null,null,null,9,null,null,null,null,null,null,null,null,null,null,null,null,null,null,null,null,null,null,null,null,null,null,null,null,null,null,null,null,null,null,null,null,null,null,null,null,9]
[null,3,"G",null,null,null,null,null,"R403","15;L:36;L:40;L:44",null,null,null,10,null,null,null,null,null,null,null,null,null,null,null,null,null,null,null,null,null,null,null,null,null,null,null,null,null,null,null,null,null,null,null,null,null,null,null,null,10]
[null,3,null,null,null,null,null,null,null,null,null,null,null,null,null,null,null,null,null,null,null,null,null,null,null,null,null,null,null,null,null,null,null,null,"Kopā",{"$f":"SUM(AJ1159:AM1168)","v":0},null,null,null,{"$f":"SUM(AN1159:AQ1168)","v":0},null,null,null,{"$f":"SUM(AR1159:AU1168)","v":0},null,null,null,null,null,null,null,null,null,null,null,null,null,null,null,null,null,null,null,null,null,null,null,null,null,null,null,"Kopā",{"$f":"SUM(BU1159:BX1168)","v":0},null,null,null,{"$f":"SUM(BY1159:CB1168)","v":0},null,null,null,{"$f":"SUM(CC1159:CF1168)","v":0}]
[null,3]
[null,4,{"$f":"C1172","v":""}]
[null,4,"",null,null,null,"x",null,null,null,null,null,null,"4.4.","Uzkrājumi",null,null,null,null,null,null,null,null,null,null,null,null,null,null,null,null,null,null,null,null,null,null,null,null,null,null,null,null,null,null,null,null,null,null,null,"4.4.","Uzkrājumi"]
[null,4,"",null,null,null,null,null,null,null,null,null,null,null,"Uzkrājuma veids",null,null,null,null,"Paredzamais saistību rašanās laiks",null,null,null,"Paredzamais saistību segšanas laiks",null,null,null,"Paredzētā izdevumu atlīdzināšanas summa, ja izdevumus atlīdzinās trešā persona",null,null,null,null,"Uzkrājuma vērtības un diskonta likmes izmaiņu ietekme (ja novērtēšana veikta izmantojot diskontēšanu)",null,null,null,null,null,null,null,null,null,null,null,null,null,null,null,null,null,null,"Uzkrājuma veids",null,null,null,null,"Paredzamais saistību rašanās laiks",null,null,null,"Paredzamais saistību segšanas laiks",null,null,null,"Paredzētā izdevumu atlīdzināšanas summa, ja izdevumus atlīdzinās trešā persona",null,null,null,null,"Uzkrājuma vērtības un diskonta likmes izmaiņu ietekme (ja novērtēšana veikta izmantojot diskontēšanu)"]
[null,4,""]
[null,4,{"$f":"C1176","v":""}]
[null,4,{"$f":"IF(C1177=\"GS\",\"S\",\"\")","v":""}]
[null,4,{"$f":"IFERROR(IF(OR(O1177<>\"\",AZ1177<>\"\"),\"GS\",\"G\"),\"GS\")","v":"G"},null,null,null,null,null,"R404",{"$f":"COLUMN(O1177)&\";\"&COLUMN(T1177)&\";\"&COLUMN(X1177)&\";L:\"&COLUMN(AB1177)&\";\"&COLUMN(AG1177)","v":"15;20;24;L:28;33"},null,null,null,1,null,null,null,null,null,null,null,null,null,null,null,null,null,null,null,null,null,null,null,null,null,null,null,null,null,null,null,null,null,null,null,null,null,null,null,null,1]
[null,4,"G",null,null,null,null,null,"R404","15;20;24;L:28;33",null,null,null,2,null,null,null,null,null,null,null,null,null,null,null,null,null,null,null,null,null,null,null,null,null,null,null,null,null,null,null,null,null,null,null,null,null,null,null,null,2]
[null,4,"G",null,null,null,null,null,"R404","15;20;24;L:28;33",null,null,null,3,null,null,null,null,null,null,null,null,null,null,null,null,null,null,null,null,null,null,null,null,null,null,null,null,null,null,null,null,null,null,null,null,null,null,null,null,3]
[null,4,"G",null,null,null,null,null,"R404","15;20;24;L:28;33",null,null,null,4,null,null,null,null,null,null,null,null,null,null,null,null,null,null,null,null,null,null,null,null,null,null,null,null,null,null,null,null,null,null,null,null,null,null,null,null,4]
[null,4,"G",null,null,null,null,null,"R404","15;20;24;L:28;33",null,null,null,5,null,null,null,null,null,null,null,null,null,null,null,null,null,null,null,null,null,null,null,null,null,null,null,null,null,null,null,null,null,null,null,null,null,null,null,null,5]
[null,4,"G",null,null,null,null,null,"R404","15;20;24;L:28;33",null,null,null,6,null,null,null,null,null,null,null,null,null,null,null,null,null,null,null,null,null,null,null,null,null,null,null,null,null,null,null,null,null,null,null,null,null,null,null,null,6]
[null,4,"G",null,null,null,null,null,"R404","15;20;24;L:28;33",null,null,null,7,null,null,null,null,null,null,null,null,null,null,null,null,null,null,null,null,null,null,null,null,null,null,null,null,null,null,null,null,null,null,null,null,null,null,null,null,7]
[null,4,"G",null,null,null,null,null,"R404","15;20;24;L:28;33",null,null,null,8,null,null,null,null,null,null,null,null,null,null,null,null,null,null,null,null,null,null,null,null,null,null,null,null,null,null,null,null,null,null,null,null,null,null,null,null,8]
[null,4,"G",null,null,null,null,null,"R404","15;20;24;L:28;33",null,null,null,9,null,null,null,null,null,null,null,null,null,null,null,null,null,null,null,null,null,null,null,null,null,null,null,null,null,null,null,null,null,null,null,null,null,null,null,null,9]
[null,4,"G",null,null,null,null,null,"R404","15;20;24;L:28;33",null,null,null,10,null,null,null,null,null,null,null,null,null,null,null,null,null,null,null,null,null,null,null,null,null,null,null,null,null,null,null,null,null,null,null,null,null,null,null,null,10]
[null,4,{"$f":"C1176","v":""},null,null,null,null,null,null,null,null,null,null,null,null,null,null,null,null,null,null,null,null,null,null,null,"Kopā",{"$f":"SUM(AB1177:AF1186)","v":0},null,null,null,null,null,null,null,null,null,null,null,null,null,null,null,null,null,null,null,null,null,null,null,null,null,null,null,null,null,null,null,null,null,null,null,"Kopā",{"$f":"SUM(BM1177:BQ1186)","v":0}]
[null,4,{"$f":"C1187","v":""}]
[null,4,{"$f":"C1190","v":""}]
[null,4,{"$f":"IF(C1191=\"GS\",\"S\",\"\")","v":""},null,null,null,"x",null,null,null,null,null,null,"4.4.1.","nformācija par uzkrājumu un iespējamo saistību sakarību, ja uzkrājumi tiek veidoti kāda konkrēta pagātnes notikuma dēļ",null,null,null,null,null,null,null,null,null,null,null,null,null,null,null,null,null,null,null,null,null,null,null,null,null,null,null,null,null,null,null,null,null,null,null,"4.4.1.","nformācija par uzkrājumu un iespējamo saistību sakarību, ja uzkrājumi tiek veidoti kāda konkrēta pagātnes notikuma dēļ"]
[null,4,{"$f":"IFERROR(IF(OR(N1191<>\"\",AY1191<>\"\"),\"GS\",\"G\"),\"GS\")","v":"G"},null,null,null,null,null,"R40401",{"$f":"COLUMN(N1191)","v":14},{"$f":"LEFT(IF(LEN(N1191)<LEN(AY1191),AY1191,N1191),LEN(IF(LEN(N1191)<LEN(AY1191),AY1191,N1191))/2)","v":""},null,null,null,null,null,null,null,null,null,null,null,null,null,null,null,null,null,null,null,null,null,null,null,null,null,null,null,null,null,null,null,null,null,null,null,null,null,null,null,null,null,null,null,null,null,null,null,null,null,null,null,null,null,null,null,null,null,null,null,null,null,null,null,null,null,null,null,null,null,null,null,null,null,null,null,{"$f":"N1190","v":"4.4.1."}]
[null,4,{"$f":"C1191","v":"G"},null,null,null,null,null,null,{"$f":"COLUMN(N1192)","v":14},{"$f":"RIGHT(IF(LEN(N1191)<LEN(AY1191),AY1191,N1191),LEN(IF(LEN(N1191)<LEN(AY1191),AY1191,N1191))/2)","v":""}]
[null,2]
[null,2,null,null,"x","x","x",null,null,null,null,null,null,"4.5.","Kreditori",null,null,null,null,null,null,null,null,null,null,null,null,null,null,null,null,null,null,null,null,null,null,null,null,null,null,null,null,null,null,null,null,null,null,null,"4.5.","Kreditori"]
[null,2,null,null,"x","x","x",null,null,null,null,null,null,"4.5.1.","atliktā nodokļa saistību atlikumi",null,null,null,null,null,null,null,null,null,null,null,null,null,null,null,null,null,null,null,null,null,null,null,null,null,null,null,null,null,"Summa",null,null,null,null,null,"4.5.1.","atliktā nodokļa saistību atlikumi",null,null,null,null,null,null,null,null,null,null,null,null,null,null,null,null,null,null,null,null,null,null,null,null,null,null,null,null,null,"Summa"]
[null,2,{"$f":"IFERROR(IF(OR(COUNT(AS1196:AU1197)>0,COUNT(CD1196:CF1197)>0),\"GS\",\"G\"),\"GS\")","v":"G"},null,null,null,null,null,"R4050101",{"$f":"\"L:\"&COLUMN(AS1196)","v":"L:45"},null,null,null,null,"pārskata gada sākumā",null,null,null,null,null,null,null,null,null,null,null,null,null,null,null,null,null,null,null,null,null,null,null,null,null,null,null,null,null,null,null,null,null,null,null,null,"pārskata gada sākumā"]
[null,2,{"$f":"C1196","v":"G"},null,null,null,null,null,"R4050102",{"$f":"\"L:\"&COLUMN(AS1197)","v":"L:45"},null,null,null,null,"pārskata gada beigās",null,null,null,null,null,null,null,null,null,null,null,null,null,null,null,null,null,null,null,null,null,null,null,null,null,null,null,null,null,null,null,null,null,null,null,null,"pārskata gada beigās"]
[null,2,{"$f":"C1197","v":"G"},null,null,null,null,null,null,null,null,null,null,null,"izmaiņas",null,null,null,null,null,null,null,null,null,null,null,null,null,null,null,null,null,null,null,null,null,null,null,null,null,null,null,null,null,{"$f":"AS1196-AS1197","v":0},null,null,null,null,null,null,"izmaiņas",null,null,null,null,null,null,null,null,null,null,null,null,null,null,null,null,null,null,null,null,null,null,null,null,null,null,null,null,null,{"$f":"CD1196-CD1197","v":0}]
[null,2]
[null,2,null,null,"x","x","x",null,null,null,null,null,null,"4.5.2.","nodokļi un valsts sociālās apdrošināšanas obligātās iemaksas, kuru samaksas termiņš ir ilgāks par pieciem gadiem",null,null,null,null,null,null,null,null,null,null,null,null,null,null,null,null,null,null,null,null,null,null,null,null,null,null,null,null,null,"Summa",null,null,null,null,null,"4.5.2.","nodokļi un valsts sociālās apdrošināšanas obligātās iemaksas, kuru samaksas termiņš ir ilgāks par pieciem gadiem",null,null,null,null,null,null,null,null,null,null,null,null,null,null,null,null,null,null,null,null,null,null,null,null,null,null,null,null,null,"Summa"]
[null,2,{"$f":"IFERROR(IF(OR(COUNT(AS1201:AU1202)>0,COUNT(CD1201:CF1202)>0),\"GS\",\"G\"),\"GS\")","v":"G"},null,null,null,null,null,"R4050201",{"$f":"\"L:\"&COLUMN(AS1201)","v":"L:45"},null,null,null,null,"pārskata gada sākumā",null,null,null,null,null,null,null,null,null,null,null,null,null,null,null,null,null,null,null,null,null,null,null,null,null,null,null,null,null,null,null,null,null,null,null,null,"pārskata gada sākumā"]
[null,2,{"$f":"C1201","v":"G"},null,null,null,null,null,"R4050202",{"$f":"\"L:\"&COLUMN(AS1202)","v":"L:45"},null,null,null,null,"pārskata gada beigās",null,null,null,null,null,null,null,null,null,null,null,null,null,null,null,null,null,null,null,null,null,null,null,null,null,null,null,null,null,null,null,null,null,null,null,null,"pārskata gada beigās"]
[null,2,{"$f":"C1202","v":"G"},null,null,null,null,null,null,null,null,null,null,null,"izmaiņas",null,null,null,null,null,null,null,null,null,null,null,null,null,null,null,null,null,null,null,null,null,null,null,null,null,null,null,null,null,{"$f":"AS1201-AS1202","v":0},null,null,null,null,null,null,"izmaiņas",null,null,null,null,null,null,null,null,null,null,null,null,null,null,null,null,null,null,null,null,null,null,null,null,null,null,null,null,null,{"$f":"CD1201-CD1202","v":0}]
[null,2]
[null,2,null,null,"x","x","x",null,null,null,null,null,null,"4.5.3.","nākamo periodu ieņēmumi, kuru samaksas termiņš ir ilgāks par pieciem gadiem",null,null,null,null,null,null,null,null,null,null,null,null,null,null,null,null,null,null,null,null,null,null,null,null,null,null,null,null,null,"Summa",null,null,null,null,null,"4.5.3.","nākamo periodu ieņēmumi, kuru samaksas termiņš ir ilgāks par pieciem gadiem",null,null,null,null,null,null,null,null,null,null,null,null,null,null,null,null,null,null,null,null,null,null,null,null,null,null,null,null,null,"Summa"]
[null,2,{"$f":"IFERROR(IF(OR(COUNT(AS1206:AU1207)>0,COUNT(CD1206:CF1207)>0),\"GS\",\"G\"),\"GS\")","v":"G"},null,null,null,null,null,"R4050301",{"$f":"\"L:\"&COLUMN(AS1206)","v":"L:45"},null,null,null,null,"pārskata gada sākumā",null,null,null,null,null,null,null,null,null,null,null,null,null,null,null,null,null,null,null,null,null,null,null,null,null,null,null,null,null,null,null,null,null,null,null,null,"pārskata gada sākumā"]
[null,2,{"$f":"C1206","v":"G"},null,null,null,null,null,"R4050302",{"$f":"\"L:\"&COLUMN(AS1207)","v":"L:45"},null,null,null,null,"pārskata gada beigās",null,null,null,null,null,null,null,null,null,null,null,null,null,null,null,null,null,null,null,null,null,null,null,null,null,null,null,null,null,null,null,null,null,null,null,null,"pārskata gada beigās"]
[null,2,{"$f":"C1207","v":"G"},null,null,null,null,null,null,{"$f":"\"L:\"&COLUMN(AS1208)","v":"L:45"},null,null,null,null,"izmaiņas",null,null,null,null,null,null,null,null,null,null,null,null,null,null,null,null,null,null,null,null,null,null,null,null,null,null,null,null,null,{"$f":"IF(COUNTA(AS1206:AU1207)=0,\"\",AS1206-AS1207)","v":""},null,null,null,null,null,null,"izmaiņas",null,null,null,null,null,null,null,null,null,null,null,null,null,null,null,null,null,null,null,null,null,null,null,null,null,null,null,null,null,{"$f":"IF(COUNTA(CD1206:CF1207)=0,\"\",CD1206-CD1207)","v":""}]
[null,2,{"$f":"C1210","v":""}]
[null,2,{"$f":"C1211","v":""},null,"x","x","x",null,null,null,null,null,null,"4.5.4.","aizņēmumi (ilgtermiņa kreditori)",null,null,null,null,null,null,null,null,null,null,null,null,null,null,null,null,null,null,null,null,null,null,null,null,null,null,null,null,null,null,null,null,null,null,null,"4.5.4.","aizņēmumi (ilgtermiņa kreditori)"]
[null,2,{"$f":"C1212","v":""},null,null,null,null,null,null,null,null,null,null,null,"Aizņēmuma veids",null,null,null,null,null,null,null,null,null,null,null,null,null,null,null,null,null,null,null,null,"Summa",null,null,null,"Papildus sniegtā informācija, \nja tāda ir",null,null,null,null,null,null,null,null,null,null,null,"Aizņēmuma veids",null,null,null,null,null,null,null,null,null,null,null,null,null,null,null,null,null,null,null,null,"Summa",null,null,null,"Papildus sniegtā informācija, \nja tāda ir"]
[null,2,{"$f":"IF(C1213=\"GS\",\"S\",\"\")","v":""}]
[null,2,{"$f":"IFERROR(IF(OR(O1213<>\"\",AZ1213<>\"\"),\"GS\",\"G\"),\"GS\")","v":"G"},null,null,null,null,null,"R40504",{"$f":"COLUMN(O1213)&\";L:\"&COLUMN(AJ1213)&\";\"&COLUMN(AN1213)","v":"15;L:36;40"},null,null,null,1,null,null,null,null,null,null,null,null,null,null,null,null,null,null,null,null,null,null,null,null,null,null,null,null,null,null,null,null,null,null,null,null,null,null,null,null,1]
[null,2,"G",null,null,null,null,null,"R40504","15;L:36;40",null,null,null,2,null,null,null,null,null,null,null,null,null,null,null,null,null,null,null,null,null,null,null,null,null,null,null,null,null,null,null,null,null,null,null,null,null,null,null,null,2]
[null,2,"G",null,null,null,null,null,"R40504","15;L:36;40",null,null,null,3,null,null,null,null,null,null,null,null,null,null,null,null,null,null,null,null,null,null,null,null,null,null,null,null,null,null,null,null,null,null,null,null,null,null,null,null,3]
[null,2,"G",null,null,null,null,null,"R40504","15;L:36;40",null,null,null,4,null,null,null,null,null,null,null,null,null,null,null,null,null,null,null,null,null,null,null,null,null,null,null,null,null,null,null,null,null,null,null,null,null,null,null,null,4]
[null,2,"G",null,null,null,null,null,"R40504","15;L:36;40",null,null,null,5,null,null,null,null,null,null,null,null,null,null,null,null,null,null,null,null,null,null,null,null,null,null,null,null,null,null,null,null,null,null,null,null,null,null,null,null,5]
[null,2,"G",null,null,null,null,null,"R40504","15;L:36;40",null,null,null,6,null,null,null,null,null,null,null,null,null,null,null,null,null,null,null,null,null,null,null,null,null,null,null,null,null,null,null,null,null,null,null,null,null,null,null,null,6]
[null,2,"G",null,null,null,null,null,"R40504","15;L:36;40",null,null,null,7,null,null,null,null,null,null,null,null,null,null,null,null,null,null,null,null,null,null,null,null,null,null,null,null,null,null,null,null,null,null,null,null,null,null,null,null,7]
[null,2,"G",null,null,null,null,null,"R40504","15;L:36;40",null,null,null,8,null,null,null,null,null,null,null,null,null,null,null,null,null,null,null,null,null,null,null,null,null,null,null,null,null,null,null,null,null,null,null,null,null,null,null,null,8]
[null,2,"G",null,null,null,null,null,"R40504","15;L:36;40",null,null,null,9,null,null,null,null,null,null,null,null,null,null,null,null,null,null,null,null,null,null,null,null,null,null,null,null,null,null,null,null,null,null,null,null,null,null,null,null,9]
[null,2,"G",null,null,null,null,null,"R40504","15;L:36;40",null,null,null,10,null,null,null,null,null,null,null,null,null,null,null,null,null,null,null,null,null,null,null,null,null,null,null,null,null,null,null,null,null,null,null,null,null,null,null,null,10]
[null,2,{"$f":"C1224","v":""}]
[null,2,{"$f":"C1225","v":""},null,"x","x","x",null,null,null,null,null,null,"4.5.5.","starpība starp atmaksājamo un saņemto aizņēmuma summu",null,null,null,null,null,null,null,null,null,null,null,null,null,null,null,null,null,null,null,null,null,null,null,null,null,null,null,null,null,null,null,null,null,null,null,"4.5.5.","starpība starp atmaksājamo un saņemto aizņēmuma summu"]
[null,2,{"$f":"IF(C1226=\"GS\",\"S\",\"\")","v":""},null,null,null,null,null,null,null,null,null,null,null,"Summa",null,null,null,null,"Papildus sniegtā informācija, ja tāda ir",null,null,null,null,null,null,null,null,null,null,null,null,null,null,null,null,null,null,null,null,null,null,null,null,null,null,null,null,null,null,null,"Summa",null,null,null,null,"Papildus sniegtā informācija, ja tāda ir"]
[null,2,{"$f":"IFERROR(IF(OR(O1226<>\"\",AZ1226<>\"\"),\"GS\",\"G\"),\"GS\")","v":"G"},null,null,null,null,null,"R40505",{"$f":"\"L:\"&COLUMN(O1226)&\";\"&COLUMN(T1226)","v":"L:15;20"},null,null,null,1,null,null,null,null,null,null,null,null,null,null,null,null,null,null,null,null,null,null,null,null,null,null,null,null,null,null,null,null,null,null,null,null,null,null,null,null,1]
[null,2,"G",null,null,null,null,null,"R40505","L:15;20",null,null,null,2,null,null,null,null,null,null,null,null,null,null,null,null,null,null,null,null,null,null,null,null,null,null,null,null,null,null,null,null,null,null,null,null,null,null,null,null,2]
[null,2,"G",null,null,null,null,null,"R40505","L:15;20",null,null,null,3,null,null,null,null,null,null,null,null,null,null,null,null,null,null,null,null,null,null,null,null,null,null,null,null,null,null,null,null,null,null,null,null,null,null,null,null,3]
[null,2,"G",null,null,null,null,null,"R40505","L:15;20",null,null,null,4,null,null,null,null,null,null,null,null,null,null,null,null,null,null,null,null,null,null,null,null,null,null,null,null,null,null,null,null,null,null,null,null,null,null,null,null,4]
[null,2,"G",null,null,null,null,null,"R40505","L:15;20",null,null,null,5,null,null,null,null,null,null,null,null,null,null,null,null,null,null,null,null,null,null,null,null,null,null,null,null,null,null,null,null,null,null,null,null,null,null,null,null,5]
[null,2,"G",null,null,null,null,null,"R40505","L:15;20",null,null,null,6,null,null,null,null,null,null,null,null,null,null,null,null,null,null,null,null,null,null,null,null,null,null,null,null,null,null,null,null,null,null,null,null,null,null,null,null,6]
[null,2,"G",null,null,null,null,null,"R40505","L:15;20",null,null,null,7,null,null,null,null,null,null,null,null,null,null,null,null,null,null,null,null,null,null,null,null,null,null,null,null,null,null,null,null,null,null,null,null,null,null,null,null,7]
[null,2,"G",null,null,null,null,null,"R40505","L:15;20",null,null,null,8,null,null,null,null,null,null,null,null,null,null,null,null,null,null,null,null,null,null,null,null,null,null,null,null,null,null,null,null,null,null,null,null,null,null,null,null,8]
[null,2,"G",null,null,null,null,null,"R40505","L:15;20",null,null,null,9,null,null,null,null,null,null,null,null,null,null,null,null,null,null,null,null,null,null,null,null,null,null,null,null,null,null,null,null,null,null,null,null,null,null,null,null,9]
[null,2,"G",null,null,null,null,null,"R40505","L:15;20",null,null,null,10,null,null,null,null,null,null,null,null,null,null,null,null,null,null,null,null,null,null,null,null,null,null,null,null,null,null,null,null,null,null,null,null,null,null,null,null,10]
[null,2,{"$f":"C1237","v":""}]
[null,2,{"$f":"C1238","v":""},null,"x","x","x",null,null,null,null,null,null,"4.5.6.","parādi piegādātājiem un darbuzņēmējiem, saņemtie avansi, pārējie kreditori un neizmaksātās dividendes (ilgtermiņa kreditori)",null,null,null,null,null,null,null,null,null,null,null,null,null,null,null,null,null,null,null,null,null,null,null,null,null,null,null,null,null,null,null,null,null,null,null,"4.5.6.","parādi piegādātājiem un darbuzņēmējiem, saņemtie avansi, pārējie kreditori un neizmaksātās dividendes (ilgtermiņa kreditori)"]
[null,2,{"$f":"C1239","v":""},null,null,null,null,null,null,null,null,null,null,null,"Aizņēmuma veids",null,null,null,null,null,null,null,null,null,null,null,null,null,null,null,null,null,null,null,null,"Summa",null,null,null,"Papildus sniegtā informācija, \nja tāda ir",null,null,null,null,null,null,null,null,null,null,null,"Aizņēmuma veids",null,null,null,null,null,null,null,null,null,null,null,null,null,null,null,null,null,null,null,null,"Summa",null,null,null,"Papildus sniegtā informācija, \nja tāda ir"]
[null,2,{"$f":"IF(C1240=\"GS\",\"S\",\"\")","v":""}]
[null,2,{"$f":"IFERROR(IF(OR(O1240<>\"\",AZ1240<>\"\"),\"GS\",\"G\"),\"GS\")","v":"G"},null,null,null,null,null,"R40506",{"$f":"COLUMN(O1240)&\";L:\"&COLUMN(AJ1240)&\";\"&COLUMN(AN1240)","v":"15;L:36;40"},null,null,null,1,null,null,null,null,null,null,null,null,null,null,null,null,null,null,null,null,null,null,null,null,null,null,null,null,null,null,null,null,null,null,null,null,null,null,null,null,1]
[null,2,"G",null,null,null,null,null,"R40506","15;L:36;40",null,null,null,2,null,null,null,null,null,null,null,null,null,null,null,null,null,null,null,null,null,null,null,null,null,null,null,null,null,null,null,null,null,null,null,null,null,null,null,null,2]
[null,2,"G",null,null,null,null,null,"R40506","15;L:36;40",null,null,null,3,null,null,null,null,null,null,null,null,null,null,null,null,null,null,null,null,null,null,null,null,null,null,null,null,null,null,null,null,null,null,null,null,null,null,null,null,3]
[null,2,"G",null,null,null,null,null,"R40506","15;L:36;40",null,null,null,4,null,null,null,null,null,null,null,null,null,null,null,null,null,null,null,null,null,null,null,null,null,null,null,null,null,null,null,null,null,null,null,null,null,null,null,null,4]
[null,2,"G",null,null,null,null,null,"R40506","15;L:36;40",null,null,null,5,null,null,null,null,null,null,null,null,null,null,null,null,null,null,null,null,null,null,null,null,null,null,null,null,null,null,null,null,null,null,null,null,null,null,null,null,5]
[null,2,"G",null,null,null,null,null,"R40506","15;L:36;40",null,null,null,6,null,null,null,null,null,null,null,null,null,null,null,null,null,null,null,null,null,null,null,null,null,null,null,null,null,null,null,null,null,null,null,null,null,null,null,null,6]
[null,2,"G",null,null,null,null,null,"R40506","15;L:36;40",null,null,null,7,null,null,null,null,null,null,null,null,null,null,null,null,null,null,null,null,null,null,null,null,null,null,null,null,null,null,null,null,null,null,null,null,null,null,null,null,7]
[null,2,"G",null,null,null,null,null,"R40506","15;L:36;40",null,null,null,8,null,null,null,null,null,null,null,null,null,null,null,null,null,null,null,null,null,null,null,null,null,null,null,null,null,null,null,null,null,null,null,null,null,null,null,null,8]
[null,2,"G",null,null,null,null,null,"R40506","15;L:36;40",null,null,null,9,null,null,null,null,null,null,null,null,null,null,null,null,null,null,null,null,null,null,null,null,null,null,null,null,null,null,null,null,null,null,null,null,null,null,null,null,9]
[null,2,"G",null,null,null,null,null,"R40506","15;L:36;40",null,null,null,10,null,null,null,null,null,null,null,null,null,null,null,null,null,null,null,null,null,null,null,null,null,null,null,null,null,null,null,null,null,null,null,null,null,null,null,null,10]
[null,2,{"$f":"C1251","v":""}]
[null,2,{"$f":"IF(C1252=\"GS\",\"S\",\"\")","v":""},null,"x","x","x",null,null,null,null,null,null,"4.5.7.","paskaidrojums, ja kādas saistības attiecas uz vairākiem bilances shēmas posteņiem",null,null,null,null,null,null,null,null,null,null,null,null,null,null,null,null,null,null,null,null,null,null,null,null,null,null,null,null,null,null,null,null,null,null,null,"4.5.7.","paskaidrojums, ja kādas saistības attiecas uz vairākiem bilances shēmas posteņiem"]
[null,2,{"$f":"IFERROR(IF(OR(N1252<>\"\",AY1252<>\"\"),\"GS\",\"G\"),\"GS\")","v":"G"},null,null,null,null,null,"R40507",{"$f":"COLUMN(N1252)","v":14},{"$f":"LEFT(IF(LEN(N1252)<LEN(AY1252),AY1252,N1252),LEN(IF(LEN(N1252)<LEN(AY1252),AY1252,N1252))/2)","v":""},null,null,null,null,null,null,null,null,null,null,null,null,null,null,null,null,null,null,null,null,null,null,null,null,null,null,null,null,null,null,null,null,null,null,null,null,null,null,null,null,null,null,null,null,null,null,null,null,null,null,null,null,null,null,null,null,null,null,null,null,null,null,null,null,null,null,null,null,null,null,null,null,null,null,null,{"$f":"N1251","v":"4.5.7."}]
[null,2,{"$f":"C1252","v":"G"},null,null,null,null,null,null,{"$f":"COLUMN(N1253)","v":14},{"$f":"RIGHT(IF(LEN(N1252)<LEN(AY1252),AY1252,N1252),LEN(IF(LEN(N1252)<LEN(AY1252),AY1252,N1252))/2)","v":""}]
[null,2,{"$f":"C1255","v":""}]
[null,2,{"$f":"IF(C1256=\"GS\",\"S\",\"\")","v":""},null,"x","x","x",null,null,null,null,null,null,"4.5.8.","papildinformācija par bilances pasīva posteņiem, ja tāda nepieciešama patiesa un skaidra priekšstata gūšanai",null,null,null,null,null,null,null,null,null,null,null,null,null,null,null,null,null,null,null,null,null,null,null,null,null,null,null,null,null,null,null,null,null,null,null,"4.5.8.","papildinformācija par bilances pasīva posteņiem, ja tāda nepieciešama patiesa un skaidra priekšstata gūšanai"]
[null,2,{"$f":"IFERROR(IF(OR(N1256<>\"\",AY1256<>\"\"),\"GS\",\"G\"),\"GS\")","v":"G"},null,null,null,null,null,"R40508",{"$f":"COLUMN(N1256)","v":14},{"$f":"LEFT(IF(LEN(N1256)<LEN(AY1256),AY1256,N1256),LEN(IF(LEN(N1256)<LEN(AY1256),AY1256,N1256))/2)","v":""},null,null,null,null,null,null,null,null,null,null,null,null,null,null,null,null,null,null,null,null,null,null,null,null,null,null,null,null,null,null,null,null,null,null,null,null,null,null,null,null,null,null,null,null,null,null,null,null,null,null,null,null,null,null,null,null,null,null,null,null,null,null,null,null,null,null,null,null,null,null,null,null,null,null,null,{"$f":"N1255","v":"4.5.8."}]
[null,2,{"$f":"C1256","v":"G"},null,null,null,null,null,null,{"$f":"COLUMN(N1257)","v":14},{"$f":"RIGHT(IF(LEN(N1256)<LEN(AY1256),AY1256,N1256),LEN(IF(LEN(N1256)<LEN(AY1256),AY1256,N1256))/2)","v":""}]
[null,2]
[null,2,null,null,"x","x","x",null,null,null,null,null,null,"5.","Skaidrojums par peļņas vai zaudējumu aprēķinu",null,null,null,null,null,null,null,null,null,null,null,null,null,null,null,null,null,null,null,null,null,null,null,null,null,null,null,null,null,null,null,null,null,null,null,"5.","Skaidrojums par peļņas vai zaudējumu aprēķinu"]
[null,3,{"$f":"C1261","v":""}]
[null,3,{"$f":"C1262","v":""},null,null,"x","x",null,null,null,null,null,null,"5.1.","Neto apgrozījums pa darbības veidiem un ģeogrāfiskajiem tirgiem",null,null,null,null,null,null,null,null,null,null,null,null,null,null,null,null,null,null,null,null,null,null,null,null,null,null,null,null,null,null,null,null,null,null,null,"5.1.","Neto apgrozījums pa darbības veidiem un ģeogrāfiskajiem tirgiem"]
[null,3,{"$f":"IF(C1263=\"GS\",\"S\",\"\")","v":""},null,null,null,null,null,null,null,null,null,null,null,"NACE kods",null,null,null,null,null,null,null,null,null,null,null,null,null,null,null,null,null,null,null,null,null,null,null,null,null,null,null,null,"Summa",null,null,null,null,null,null,null,"NACE kods",null,null,null,null,null,null,null,null,null,null,null,null,null,null,null,null,null,null,null,null,null,null,null,null,null,null,null,null,"Summa"]
[null,3,{"$f":"IFERROR(IF(OR(O1263<>\"\",AZ1263<>\"\"),\"GS\",\"G\"),\"GS\")","v":"G"},null,null,null,null,null,"R50101",{"$f":"COLUMN(O1263)&\";L:\"&COLUMN(AR1263)","v":"15;L:44"},null,null,null,1,null,null,null,null,null,null,null,null,null,null,null,null,null,null,null,null,null,null,null,null,null,null,null,null,null,null,null,null,null,null,null,null,null,null,null,null,1]
[null,3,"G",null,null,null,null,null,"R50101","15;L:44",null,null,null,2,null,null,null,null,null,null,null,null,null,null,null,null,null,null,null,null,null,null,null,null,null,null,null,null,null,null,null,null,null,null,null,null,null,null,null,null,2]
[null,3,"G",null,null,null,null,null,"R50101","15;L:44",null,null,null,3,null,null,null,null,null,null,null,null,null,null,null,null,null,null,null,null,null,null,null,null,null,null,null,null,null,null,null,null,null,null,null,null,null,null,null,null,3]
[null,3,"G",null,null,null,null,null,"R50101","15;L:44",null,null,null,4,null,null,null,null,null,null,null,null,null,null,null,null,null,null,null,null,null,null,null,null,null,null,null,null,null,null,null,null,null,null,null,null,null,null,null,null,4]
[null,3,"G",null,null,null,null,null,"R50101","15;L:44",null,null,null,5,null,null,null,null,null,null,null,null,null,null,null,null,null,null,null,null,null,null,null,null,null,null,null,null,null,null,null,null,null,null,null,null,null,null,null,null,5]
[null,3,"G",null,null,null,null,null,"R50101","15;L:44",null,null,null,6,null,null,null,null,null,null,null,null,null,null,null,null,null,null,null,null,null,null,null,null,null,null,null,null,null,null,null,null,null,null,null,null,null,null,null,null,6]
[null,3,"G",null,null,null,null,null,"R50101","15;L:44",null,null,null,7,null,null,null,null,null,null,null,null,null,null,null,null,null,null,null,null,null,null,null,null,null,null,null,null,null,null,null,null,null,null,null,null,null,null,null,null,7]
[null,3,"G",null,null,null,null,null,"R50101","15;L:44",null,null,null,8,null,null,null,null,null,null,null,null,null,null,null,null,null,null,null,null,null,null,null,null,null,null,null,null,null,null,null,null,null,null,null,null,null,null,null,null,8]
[null,3,"G",null,null,null,null,null,"R50101","15;L:44",null,null,null,9,null,null,null,null,null,null,null,null,null,null,null,null,null,null,null,null,null,null,null,null,null,null,null,null,null,null,null,null,null,null,null,null,null,null,null,null,9]
[null,3,"G",null,null,null,null,null,"R50101","15;L:44",null,null,null,10,null,null,null,null,null,null,null,null,null,null,null,null,null,null,null,null,null,null,null,null,null,null,null,null,null,null,null,null,null,null,null,null,null,null,null,null,10]
[null,3,{"$f":"C1262","v":""},null,null,null,null,null,null,null,null,null,null,null,null,null,null,null,null,null,null,null,null,null,null,null,null,null,null,null,null,null,null,null,null,null,null,null,null,null,null,null,"Kopā pa darbības veidiem",{"$f":"SUM(AR1263:AU1272)","v":0},null,null,null,null,null,null,null,null,null,null,null,null,null,null,null,null,null,null,null,null,null,null,null,null,null,null,null,null,null,null,null,null,null,null,null,"Kopā pa darbības veidiem",{"$f":"SUM(CC1263:CF1272)","v":0}]
[null,3,{"$f":"C1275","v":""}]
[null,3,{"$f":"IF(C1276=\"GS\",\"S\",\"\")","v":""},null,null,null,null,null,null,null,null,null,null,null,"Valsts kods",null,null,null,null,null,null,null,null,null,null,null,null,null,null,null,null,null,null,null,null,null,null,null,null,null,null,null,null,"Summa",null,null,null,null,null,null,null,"Valsts kods",null,null,null,null,null,null,null,null,null,null,null,null,null,null,null,null,null,null,null,null,null,null,null,null,null,null,null,null,"Summa"]
[null,3,{"$f":"IFERROR(IF(OR(O1276<>\"\",AZ1276<>\"\"),\"GS\",\"G\"),\"GS\")","v":"G"},null,null,null,null,null,"R50102",{"$f":"COLUMN(O1276)&\";L:\"&COLUMN(AR1276)","v":"15;L:44"},null,null,null,1,null,null,null,null,null,null,null,null,null,null,null,null,null,null,null,null,null,null,null,null,null,null,null,null,null,null,null,null,null,null,null,null,null,null,null,null,1]
[null,3,"G",null,null,null,null,null,"R50102","15;L:44",null,null,null,2,null,null,null,null,null,null,null,null,null,null,null,null,null,null,null,null,null,null,null,null,null,null,null,null,null,null,null,null,null,null,null,null,null,null,null,null,2]
[null,3,"G",null,null,null,null,null,"R50102","15;L:44",null,null,null,3,null,null,null,null,null,null,null,null,null,null,null,null,null,null,null,null,null,null,null,null,null,null,null,null,null,null,null,null,null,null,null,null,null,null,null,null,3]
[null,3,"G",null,null,null,null,null,"R50102","15;L:44",null,null,null,4,null,null,null,null,null,null,null,null,null,null,null,null,null,null,null,null,null,null,null,null,null,null,null,null,null,null,null,null,null,null,null,null,null,null,null,null,4]
[null,3,"G",null,null,null,null,null,"R50102","15;L:44",null,null,null,5,null,null,null,null,null,null,null,null,null,null,null,null,null,null,null,null,null,null,null,null,null,null,null,null,null,null,null,null,null,null,null,null,null,null,null,null,5]
[null,3,"G",null,null,null,null,null,"R50102","15;L:44",null,null,null,6,null,null,null,null,null,null,null,null,null,null,null,null,null,null,null,null,null,null,null,null,null,null,null,null,null,null,null,null,null,null,null,null,null,null,null,null,6]
[null,3,"G",null,null,null,null,null,"R50102","15;L:44",null,null,null,7,null,null,null,null,null,null,null,null,null,null,null,null,null,null,null,null,null,null,null,null,null,null,null,null,null,null,null,null,null,null,null,null,null,null,null,null,7]
[null,3,"G",null,null,null,null,null,"R50102","15;L:44",null,null,null,8,null,null,null,null,null,null,null,null,null,null,null,null,null,null,null,null,null,null,null,null,null,null,null,null,null,null,null,null,null,null,null,null,null,null,null,null,8]
[null,3,"G",null,null,null,null,null,"R50102","15;L:44",null,null,null,9,null,null,null,null,null,null,null,null,null,null,null,null,null,null,null,null,null,null,null,null,null,null,null,null,null,null,null,null,null,null,null,null,null,null,null,null,9]
[null,3,"G",null,null,null,null,null,"R50102","15;L:44",null,null,null,10,null,null,null,null,null,null,null,null,null,null,null,null,null,null,null,null,null,null,null,null,null,null,null,null,null,null,null,null,null,null,null,null,null,null,null,null,10]
[null,3,{"$f":"C1275","v":""},null,null,null,null,null,null,null,null,null,null,null,null,null,null,null,null,null,null,null,null,null,null,null,null,null,null,null,null,null,null,null,null,null,null,null,null,null,null,null,"Kopā pa ģeogrāfiskiem tirgiem",{"$f":"SUM(AR1276:AU1285)","v":0},null,null,null,null,null,null,null,null,null,null,null,null,null,null,null,null,null,null,null,null,null,null,null,null,null,null,null,null,null,null,null,null,null,null,null,"Kopā pa ģeogrāfiskiem tirgiem",{"$f":"SUM(CC1276:CF1285)","v":0}]
[null,3,{"$f":"C1288","v":""}]
[null,3,{"$f":"IF(C1289=\"GS\",\"S\",\"\")","v":""},null,null,null,null,null,null,null,null,null,null,"Papildus sniegtā informācija, ja tāda ir",null,null,null,null,null,null,null,null,null,null,null,null,null,null,null,null,null,null,null,null,null,null,null,null,null,null,null,null,null,null,null,null,null,null,null,null,"Papildus sniegtā informācija, ja tāda ir"]
[null,3,{"$f":"IFERROR(IF(OR(N1289<>\"\",AY1289<>\"\"),\"GS\",\"G\"),\"GS\")","v":"G"},null,null,null,null,null,"R50103",{"$f":"COLUMN(N1289)","v":14},{"$f":"LEFT(IF(LEN(N1289)<LEN(AY1289),AY1289,N1289),LEN(IF(LEN(N1289)<LEN(AY1289),AY1289,N1289))/2)","v":""},null,null,null,null,null,null,null,null,null,null,null,null,null,null,null,null,null,null,null,null,null,null,null,null,null,null,null,null,null,null,null,null,null,null,null,null,null,null,null,null,null,null,null,null,null,null,null,null,null,null,null,null,null,null,null,null,null,null,null,null,null,null,null,null,null,null,null,null,null,null,null,null,null,null,null,"x"]
[null,3,{"$f":"C1289","v":"G"},null,null,null,null,null,null,{"$f":"COLUMN(N1290)","v":14},{"$f":"RIGHT(IF(LEN(N1289)<LEN(AY1289),AY1289,N1289),LEN(IF(LEN(N1289)<LEN(AY1289),AY1289,N1289))/2)","v":""}]
[null,2]
[null,2,null,null,"x","x","x",null,null,null,null,null,null,"5.2.","Skaidrojums par pārskata gadā un iepriekšējos pārskata gados saņemto finanšu palīdzību",null,null,null,null,null,null,null,null,null,null,null,null,null,null,null,null,null,null,null,null,null,null,null,null,null,null,null,null,null,null,null,null,null,null,null,"5.2.","Skaidrojums par pārskata gadā un iepriekšējos pārskata gados saņemto finanšu palīdzību"]
[null,2,null,null,null,null,null,null,null,null,null,null,null,null,"Finanšu palīdzības sniedzējs",null,null,null,null,null,null,null,null,"Kad saņemts (gads)",null,null,"Summa",null,null,null,"Saņemšanas mērķis",null,null,null,null,null,"Nosacījumi",null,null,null,null,null,"Pārskata gadā \natmaksājamā summa, ja nav izpildīts kāds no nosacījumiem",null,null,null,null,null,null,null,null,"Finanšu palīdzības sniedzējs",null,null,null,null,null,null,null,null,"Kad saņemts (gads)",null,null,"Summa",null,null,null,"Saņemšanas mērķis",null,null,null,null,null,"Nosacījumi",null,null,null,null,null,"Pārskata gadā \natmaksājamā summa, ja nav izpildīts kāds no nosacījumiem"]
[null,2]
[null,2]
[null,2,{"$f":"IF(C1297=\"GS\",\"S\",\"\")","v":""}]
[null,2,{"$f":"IFERROR(IF(OR(O1297<>\"\",AZ1297<>\"\"),\"GS\",\"G\"),\"GS\")","v":"G"},null,null,null,null,null,"R502",{"$f":"COLUMN(O1297)&\";L:\"&COLUMN(X1297)&\";L:\"&COLUMN(AA1297)&\";\"&COLUMN(AE1297)&\";\"&COLUMN(AK1297)&\";L:\"&COLUMN(AQ1297)","v":"15;L:24;L:27;31;37;L:43"},null,null,null,1,null,null,null,null,null,null,null,null,null,null,null,null,null,null,null,null,null,null,null,null,null,null,null,null,null,null,null,null,null,null,null,null,null,null,null,null,1]
[null,2,"G",null,null,null,null,null,"R502","15;L:24;L:27;31;37;L:43",null,null,null,2,null,null,null,null,null,null,null,null,null,null,null,null,null,null,null,null,null,null,null,null,null,null,null,null,null,null,null,null,null,null,null,null,null,null,null,null,2]
[null,2,"G",null,null,null,null,null,"R502","15;L:24;L:27;31;37;L:43",null,null,null,3,null,null,null,null,null,null,null,null,null,null,null,null,null,null,null,null,null,null,null,null,null,null,null,null,null,null,null,null,null,null,null,null,null,null,null,null,3]
[null,2,"G",null,null,null,null,null,"R502","15;L:24;L:27;31;37;L:43",null,null,null,4,null,null,null,null,null,null,null,null,null,null,null,null,null,null,null,null,null,null,null,null,null,null,null,null,null,null,null,null,null,null,null,null,null,null,null,null,4]
[null,2,"G",null,null,null,null,null,"R502","15;L:24;L:27;31;37;L:43",null,null,null,5,null,null,null,null,null,null,null,null,null,null,null,null,null,null,null,null,null,null,null,null,null,null,null,null,null,null,null,null,null,null,null,null,null,null,null,null,5]
[null,2,"G",null,null,null,null,null,"R502","15;L:24;L:27;31;37;L:43",null,null,null,6,null,null,null,null,null,null,null,null,null,null,null,null,null,null,null,null,null,null,null,null,null,null,null,null,null,null,null,null,null,null,null,null,null,null,null,null,6]
[null,2,"G",null,null,null,null,null,"R502","15;L:24;L:27;31;37;L:43",null,null,null,7,null,null,null,null,null,null,null,null,null,null,null,null,null,null,null,null,null,null,null,null,null,null,null,null,null,null,null,null,null,null,null,null,null,null,null,null,7]
[null,2,"G",null,null,null,null,null,"R502","15;L:24;L:27;31;37;L:43",null,null,null,8,null,null,null,null,null,null,null,null,null,null,null,null,null,null,null,null,null,null,null,null,null,null,null,null,null,null,null,null,null,null,null,null,null,null,null,null,8]
[null,2,"G",null,null,null,null,null,"R502","15;L:24;L:27;31;37;L:43",null,null,null,9,null,null,null,null,null,null,null,null,null,null,null,null,null,null,null,null,null,null,null,null,null,null,null,null,null,null,null,null,null,null,null,null,null,null,null,null,9]
[null,2,"G",null,null,null,null,null,"R502","15;L:24;L:27;31;37;L:43",null,null,null,10,null,null,null,null,null,null,null,null,null,null,null,null,null,null,null,null,null,null,null,null,null,null,null,null,null,null,null,null,null,null,null,null,null,null,null,null,10]
[null,2,{"$f":"C1308","v":""}]
[null,3,{"$f":"IF(C1309=\"GS\",\"S\",\"\")","v":""},null,null,null,null,null,null,null,null,null,null,"Papildus sniegtā informācija, ja tāda ir",null,null,null,null,null,null,null,null,null,null,null,null,null,null,null,null,null,null,null,null,null,null,null,null,null,null,null,null,null,null,null,null,null,null,null,null,"Papildus sniegtā informācija, ja tāda ir"]
[null,2,{"$f":"IFERROR(IF(OR(N1309<>\"\",AY1309<>\"\"),\"GS\",\"G\"),\"GS\")","v":"G"},null,"x","x","x",null,"R50201",{"$f":"COLUMN(N1309)","v":14},{"$f":"LEFT(IF(LEN(N1309)<LEN(AY1309),AY1309,N1309),LEN(IF(LEN(N1309)<LEN(AY1309),AY1309,N1309))/2)","v":""}]
[null,2,{"$f":"C1309","v":"G"},null,null,null,null,null,null,{"$f":"COLUMN(N1310)","v":14},{"$f":"RIGHT(IF(LEN(N1309)<LEN(AY1309),AY1309,N1309),LEN(IF(LEN(N1309)<LEN(AY1309),AY1309,N1309))/2)","v":""}]
[null,3]
[null,3,{"$f":"C1313","v":""},null,null,"x","x",null,null,null,null,null,null,"5.3.","Skaidrojums par ieņēmumu un izdevumu posteņiem",null,null,null,null,null,null,null,null,null,null,null,null,null,null,null,null,null,null,null,null,null,null,null,null,null,null,null,null,null,null,null,null,null,null,null,"5.3.","Skaidrojums par ieņēmumu un izdevumu posteņiem"]
[null,3,{"$f":"IF(C1314=\"GS\",\"S\",\"\")","v":""},null,null,"x","x",null,null,null,null,null,null,"5.3.1.","skaidrojums par ieņēmumu posteņiem, kas nepārprotami atšķiras no sabiedrības parastās darbības",null,null,null,null,null,null,null,null,null,null,null,null,null,null,null,null,null,null,null,null,null,null,null,null,null,null,null,null,null,null,null,null,null,null,null,"5.3.1.","skaidrojums par ieņēmumu posteņiem, kas nepārprotami atšķiras no sabiedrības parastās darbības"]
[null,3,{"$f":"IFERROR(IF(OR(N1314<>\"\",AY1314<>\"\"),\"GS\",\"G\"),\"GS\")","v":"G"},null,null,null,null,null,"R50301",{"$f":"COLUMN(N1314)","v":14},{"$f":"LEFT(IF(LEN(N1314)<LEN(AY1314),AY1314,N1314),LEN(IF(LEN(N1314)<LEN(AY1314),AY1314,N1314))/2)","v":""},null,null,null,null,null,null,null,null,null,null,null,null,null,null,null,null,null,null,null,null,null,null,null,null,null,null,null,null,null,null,null,null,null,null,null,null,null,null,null,null,null,null,null,null,null,null,null,null,null,null,null,null,null,null,null,null,null,null,null,null,null,null,null,null,null,null,null,null,null,null,null,null,null,null,null,{"$f":"N1313","v":"5.3.1."}]
[null,3,{"$f":"C1314","v":"G"},null,null,null,null,null,null,{"$f":"COLUMN(N1315)","v":14},{"$f":"RIGHT(IF(LEN(N1314)<LEN(AY1314),AY1314,N1314),LEN(IF(LEN(N1314)<LEN(AY1314),AY1314,N1314))/2)","v":""}]
[null,3,{"$f":"C1317","v":""}]
[null,3,{"$f":"IF(C1318=\"GS\",\"S\",\"\")","v":""},null,null,"x","x",null,null,null,null,null,null,"5.3.2.","informācija par saņemtajiem ziedojumiem un dāvinājumiem, ja tie ir būtiski novērtējot sabiedrības saimnieciskās darbību:",null,null,null,null,null,null,null,null,null,null,null,null,null,null,null,null,null,null,null,null,null,null,null,null,null,null,null,null,null,"Summa",null,null,null,null,null,"5.3.2.","informācija par saņemtajiem ziedojumiem un dāvinājumiem, ja tie ir būtiski novērtējot sabiedrības saimnieciskās darbību:",null,null,null,null,null,null,null,null,null,null,null,null,null,null,null,null,null,null,null,null,null,null,null,null,null,null,null,null,null,"Summa"]
[null,3,{"$f":"IFERROR(IF(OR(COUNT(AS1318:AU1319)>0,COUNT(CD1318:CF1319)>0),\"GS\",\"G\"),\"GS\")","v":"G"},null,null,null,null,null,"R5030201",{"$f":"\"L:\"&COLUMN(AS1318)","v":"L:45"},null,null,null,null,"pārskata gadā",null,null,null,null,null,null,null,null,null,null,null,null,null,null,null,null,null,null,null,null,null,null,null,null,null,null,null,null,null,null,null,null,null,null,null,null,"pārskata gadā"]
[null,3,{"$f":"C1318","v":"G"},null,null,null,null,null,"R5030202",{"$f":"\"L:\"&COLUMN(AS1319)","v":"L:45"},null,null,null,null,"iepriekšējos pārskata periodos",null,null,null,null,null,null,null,null,null,null,null,null,null,null,null,null,null,null,null,null,null,null,null,null,null,null,null,null,null,null,null,null,null,null,null,null,"iepriekšējos pārskata periodos"]
[null,3,{"$f":"C1321","v":""}]
[null,3,{"$f":"IF(C1322=\"GS\",\"S\",\"\")","v":""},null,null,"x","x",null,null,null,null,null,null,"5.3.3.","skaidrojums par izdevumu posteņiem, kas nepārprotami atšķiras no sabiedrības parastās darbības",null,null,null,null,null,null,null,null,null,null,null,null,null,null,null,null,null,null,null,null,null,null,null,null,null,null,null,null,null,null,null,null,null,null,null,"5.3.3.","skaidrojums par izdevumu posteņiem, kas nepārprotami atšķiras no sabiedrības parastās darbības"]
[null,3,{"$f":"IFERROR(IF(OR(N1322<>\"\",AY1322<>\"\"),\"GS\",\"G\"),\"GS\")","v":"G"},null,null,null,null,null,"R50303",{"$f":"COLUMN(N1322)","v":14},{"$f":"LEFT(IF(LEN(N1322)<LEN(AY1322),AY1322,N1322),LEN(IF(LEN(N1322)<LEN(AY1322),AY1322,N1322))/2)","v":""},null,null,null,null,null,null,null,null,null,null,null,null,null,null,null,null,null,null,null,null,null,null,null,null,null,null,null,null,null,null,null,null,null,null,null,null,null,null,null,null,null,null,null,null,null,null,null,null,null,null,null,null,null,null,null,null,null,null,null,null,null,null,null,null,null,null,null,null,null,null,null,null,null,null,null,{"$f":"N1321","v":"5.3.3."}]
[null,3,{"$f":"C1322","v":"G"},null,null,null,null,null,null,{"$f":"COLUMN(N1323)","v":14},{"$f":"RIGHT(IF(LEN(N1322)<LEN(AY1322),AY1322,N1322),LEN(IF(LEN(N1322)<LEN(AY1322),AY1322,N1322))/2)","v":""}]
[null,3]
[null,3,null,null,null,"x","x",null,null,null,null,null,null,"5.3.4.","atlīdzība vadībai:",null,null,null,null,null,null,null,null,null,null,null,null,null,null,null,null,null,null,null,null,null,null,null,null,null,null,null,null,null,"Summa",null,null,null,null,null,"5.3.4.","atlīdzība vadībai:",null,null,null,null,null,null,null,null,null,null,null,null,null,null,null,null,null,null,null,null,null,null,null,null,null,null,null,null,null,"Summa"]
[null,3,{"$f":"IFERROR(IF(OR(COUNT(AS1326:AU1327)>0,COUNT(CD1326:CF1327)>0),\"GS\",\"G\"),\"GS\")","v":"G"},null,null,null,null,null,"R5030401",{"$f":"\"L:\"&COLUMN(AS1326)","v":"L:45"},null,null,null,null,"padomes locekļi",null,null,null,null,null,null,null,null,null,null,null,null,null,null,null,null,null,null,null,null,null,null,null,null,null,null,null,null,null,null,null,null,null,null,null,null,"padomes locekļi"]
[null,3,{"$f":"C1326","v":"G"},null,null,null,null,null,"R5030402",{"$f":"\"L:\"&COLUMN(AS1327)","v":"L:45"},null,null,null,null,"valdes locekļi",null,null,null,null,null,null,null,null,null,null,null,null,null,null,null,null,null,null,null,null,null,null,null,null,null,null,null,null,null,null,null,null,null,null,null,null,"valdes locekļi"]
[null,4,{"$f":"C1329","v":""}]
[null,4,{"$f":"IF(COUNT(AS1330:AU1333)>0,\"S\",\"\")","v":""},null,null,null,"x",null,null,null,null,null,null,"5.3.5.","personāla izmaksas:",null,null,null,null,null,null,null,null,null,null,null,null,null,null,null,null,null,null,null,null,null,null,null,null,null,null,null,null,null,"Summa",null,null,null,null,null,"5.3.5.","personāla izmaksas:",null,null,null,null,null,null,null,null,null,null,null,null,null,null,null,null,null,null,null,null,null,null,null,null,null,null,null,null,null,"Summa"]
[null,4,{"$f":"IFERROR(IF(OR(AS1330<>\"\",CD1330<>\"\"),\"GS\",\"G\"),\"GS\")","v":"G"},null,null,null,null,null,"R5030501",{"$f":"\"L:\"&COLUMN(AS1330)","v":"L:45"},null,null,null,null,"atlīdzība par darbu",null,null,null,null,null,null,null,null,null,null,null,null,null,null,null,null,null,null,null,null,null,null,null,null,null,null,null,null,null,null,null,null,null,null,null,null,"atlīdzība par darbu"]
[null,4,{"$f":"IFERROR(IF(OR(AS1331<>\"\",CD1331<>\"\"),\"GS\",\"G\"),\"GS\")","v":"G"},null,null,null,null,null,"R5030502",{"$f":"\"L:\"&COLUMN(AS1331)","v":"L:45"},null,null,null,null,"pensijas no sabiedrības līdzekļiem",null,null,null,null,null,null,null,null,null,null,null,null,null,null,null,null,null,null,null,null,null,null,null,null,null,null,null,null,null,null,null,null,null,null,null,null,"pensijas no sabiedrības līdzekļiem"]
[null,4,"G",null,null,null,null,null,"R5030503",{"$f":"\"L:\"&COLUMN(AS1332)","v":"L:45"},null,null,null,null,"valsts sociālās apdrošināšanas izmaksas",null,null,null,null,null,null,null,null,null,null,null,null,null,null,null,null,null,null,null,null,null,null,null,null,null,null,null,null,null,null,null,null,null,null,null,null,"valsts sociālās apdrošināšanas izmaksas"]
[null,4,"G",null,null,null,null,null,"R5030504",{"$f":"\"L:\"&COLUMN(AS1333)","v":"L:45"},null,null,null,null,"pārējās sociālās nodrošināšanas izmaksas",null,null,null,null,null,null,null,null,null,null,null,null,null,null,null,null,null,null,null,null,null,null,null,null,null,null,null,null,null,null,null,null,null,null,null,null,"pārējās sociālās nodrošināšanas izmaksas"]
[null,2,{"$f":"C1335","v":""}]
[null,2,{"$f":"C1336","v":""},null,"x","x","x",null,null,null,null,null,null,"5.4.","Skaidrojums par ieņēmumu un izdevumu posteņiem",null,null,null,null,null,null,null,null,null,null,null,null,null,null,null,null,null,null,null,null,null,null,null,null,null,null,null,null,null,null,null,null,null,null,null,"5.4.","Skaidrojums par ieņēmumu un izdevumu posteņiem"]
[null,2,{"$f":"C1337","v":""},null,null,null,null,null,null,null,null,null,null,null,"Ilgtermiņa ieguldījumu objekts \n(vai objektu grupa)",null,null,null,null,null,null,null,null,null,null,null,null,"Bilances vērtība izslēgšanas brīdī",null,null,null,"Atsavināšanas ieņēmumi",null,null,null,"Atsavināšanas izdevumi",null,null,null,"Bruto ieņēmumi vai izdevumi",null,null,null,"Peļņa vai zaudējumi no objekta atsavināšanas",null,null,null,null,null,null,null,"Ilgtermiņa ieguldījumu objekts \n(vai objektu grupa)",null,null,null,null,null,null,null,null,null,null,null,null,"Bilances vērtība izslēgšanas brīdī",null,null,null,"Atsavināšanas ieņēmumi",null,null,null,"Atsavināšanas izdevumi",null,null,null,"Bruto ieņēmumi vai izdevumi",null,null,null,"Peļņa vai zaudējumi no objekta atsavināšanas"]
[null,2,{"$f":"C1338","v":""}]
[null,2,{"$f":"IF(C1339=\"GS\",\"S\",\"\")","v":""}]
[null,2,{"$f":"IFERROR(IF(OR(O1339<>\"\",AZ1339<>\"\"),\"GS\",\"G\"),\"GS\")","v":"G"},null,null,null,null,null,"R504",{"$f":"COLUMN(O1339)&\";L:\"&COLUMN(AB1339)&\";L:\"&COLUMN(AF1339)&\";L:\"&COLUMN(AJ1339)&\";L:\"&COLUMN(AN1339)&\";L:\"&COLUMN(AR1339)","v":"15;L:28;L:32;L:36;L:40;L:44"},null,null,null,1,null,null,null,null,null,null,null,null,null,null,null,null,null,null,null,null,null,null,null,null,null,null,null,null,null,null,null,null,null,null,null,null,null,null,null,null,1]
[null,2,"G",null,null,null,null,null,"R504","15;L:28;L:32;L:36;L:40;L:44",null,null,null,2,null,null,null,null,null,null,null,null,null,null,null,null,null,null,null,null,null,null,null,null,null,null,null,null,null,null,null,null,null,null,null,null,null,null,null,null,2]
[null,2,"G",null,null,null,null,null,"R504","15;L:28;L:32;L:36;L:40;L:44",null,null,null,3,null,null,null,null,null,null,null,null,null,null,null,null,null,null,null,null,null,null,null,null,null,null,null,null,null,null,null,null,null,null,null,null,null,null,null,null,3]
[null,2,"G",null,null,null,null,null,"R504","15;L:28;L:32;L:36;L:40;L:44",null,null,null,4,null,null,null,null,null,null,null,null,null,null,null,null,null,null,null,null,null,null,null,null,null,null,null,null,null,null,null,null,null,null,null,null,null,null,null,null,4]
[null,2,"G",null,null,null,null,null,"R504","15;L:28;L:32;L:36;L:40;L:44",null,null,null,5,null,null,null,null,null,null,null,null,null,null,null,null,null,null,null,null,null,null,null,null,null,null,null,null,null,null,null,null,null,null,null,null,null,null,null,null,5]
[null,2,"G",null,null,null,null,null,"R504","15;L:28;L:32;L:36;L:40;L:44",null,null,null,6,null,null,null,null,null,null,null,null,null,null,null,null,null,null,null,null,null,null,null,null,null,null,null,null,null,null,null,null,null,null,null,null,null,null,null,null,6]
[null,2,"G",null,null,null,null,null,"R504","15;L:28;L:32;L:36;L:40;L:44",null,null,null,7,null,null,null,null,null,null,null,null,null,null,null,null,null,null,null,null,null,null,null,null,null,null,null,null,null,null,null,null,null,null,null,null,null,null,null,null,7]
[null,2,"G",null,null,null,null,null,"R504","15;L:28;L:32;L:36;L:40;L:44",null,null,null,8,null,null,null,null,null,null,null,null,null,null,null,null,null,null,null,null,null,null,null,null,null,null,null,null,null,null,null,null,null,null,null,null,null,null,null,null,8]
[null,2,"G",null,null,null,null,null,"R504","15;L:28;L:32;L:36;L:40;L:44",null,null,null,9,null,null,null,null,null,null,null,null,null,null,null,null,null,null,null,null,null,null,null,null,null,null,null,null,null,null,null,null,null,null,null,null,null,null,null,null,9]
[null,2,"G",null,null,null,null,null,"R504","15;L:28;L:32;L:36;L:40;L:44",null,null,null,10,null,null,null,null,null,null,null,null,null,null,null,null,null,null,null,null,null,null,null,null,null,null,null,null,null,null,null,null,null,null,null,null,null,null,null,null,10]
[null,2,null,null,null,null,null,null,null,null,null,null,null,null,null,null,null,null,null,null,null,null,null,null,null,null,"Kopā",{"$f":"SUM(AB1339:AE1348)","v":0},null,null,null,{"$f":"SUM(AF1339:AI1348)","v":0},null,null,null,{"$f":"SUM(AJ1339:AM1348)","v":0},null,null,null,{"$f":"SUM(AN1339:AQ1348)","v":0},null,null,null,{"$f":"SUM(AR1339:AU1348)","v":0},null,null,null,null,null,null,null,null,null,null,null,null,null,null,null,null,null,null,null,"Kopā",{"$f":"SUM(BM1339:BP1348)","v":0},null,null,null,{"$f":"SUM(BQ1339:BT1348)","v":0},null,null,null,{"$f":"SUM(BU1339:BX1348)","v":0},null,null,null,{"$f":"SUM(BY1339:CB1348)","v":0},null,null,null,{"$f":"SUM(CC1339:CF1348)","v":0}]
[null,2,{"$f":"C1351","v":""}]
[null,2,{"$f":"IF(C1352=\"GS\",\"S\",\"\")","v":""},null,null,null,null,null,null,null,null,null,null,"Papildus sniegtā informācija, ja tāda ir",null,null,null,null,null,null,null,null,null,null,null,null,null,null,null,null,null,null,null,null,null,null,null,null,null,null,null,null,null,null,null,null,null,null,null,null,"Papildus sniegtā informācija, ja tāda ir"]
[null,2,{"$f":"IFERROR(IF(OR(N1352<>\"\",AY1352<>\"\"),\"GS\",\"G\"),\"GS\")","v":"G"},null,"x","x","x",null,"R50401",{"$f":"COLUMN(N1352)","v":14},{"$f":"LEFT(IF(LEN(N1352)<LEN(AY1352),AY1352,N1352),LEN(IF(LEN(N1352)<LEN(AY1352),AY1352,N1352))/2)","v":""},null,null,null,null,null,null,null,null,null,null,null,null,null,null,null,null,null,null,null,null,null,null,null,null,null,null,null,null,null,null,null,null,null,null,null,null,null,null,null,null,null,null,null,null,null,null,null,null,null,null,null,null,null,null,null,null,null,null,null,null,null,null,null,null,null,null,null,null,null,null,null,null,null,null,null,"x"]
[null,2,{"$f":"C1352","v":"G"},null,null,null,null,null,null,{"$f":"COLUMN(N1353)","v":14},{"$f":"RIGHT(IF(LEN(N1352)<LEN(AY1352),AY1352,N1352),LEN(IF(LEN(N1352)<LEN(AY1352),AY1352,N1352))/2)","v":""}]
[null,2,{"$f":"C1355","v":""}]
[null,2,"",null,"x","x","x",null,null,null,null,null,null,"5.5.","Ar nepabeigtajiem būvdarbu līgumiem saistītie ieņēmumi un izmaksas",null,null,null,null,null,null,null,null,null,null,null,null,null,null,null,null,null,null,null,null,null,null,null,null,null,null,null,null,null,null,null,null,null,null,null,"5.5.","Ar nepabeigtajiem būvdarbu līgumiem saistītie ieņēmumi un izmaksas"]
[null,2,"",null,null,null,null,null,null,null,null,null,null,null,"Pasūtītājs un līguma Nr.\n(šo informāciju atļauts nenorādīt)",null,null,null,null,null,null,null,null,null,null,null,null,"Radušos izmaksu kopsumma",null,null,null,"Atzīto ieņēmumu kopsumma",null,null,null,"Aplēsto gaidāmo zaudējumu kopsumma \n(ja tāda ir)",null,null,null,"No pasūtītājiem saņemto avansa maksājumu kopsumma",null,null,null,"Pasūtītāju aizturēto maksājumu kopsumma par līguma nosacījumu neievērošanu vai nekvalitatīvu darbu izpildi",null,null,null,null,null,null,null,"Pasūtītājs un līguma Nr.\n(šo informāciju atļauts nenorādīt)",null,null,null,null,null,null,null,null,null,null,null,null,"Radušos izmaksu kopsumma",null,null,null,"Atzīto ieņēmumu kopsumma",null,null,null,"Aplēsto gaidāmo zaudējumu kopsumma \n(ja tāda ir)",null,null,null,"No pasūtītājiem saņemto avansa maksājumu kopsumma",null,null,null,"Pasūtītāju aizturēto maksājumu kopsumma par līguma nosacījumu neievērošanu vai nekvalitatīvu darbu izpildi"]
[null,2,""]
[null,2,""]
[null,2,""]
[null,2,{"$f":"C1361","v":""}]
[null,2,{"$f":"IF(C1362=\"GS\",\"S\",\"\")","v":""}]
[null,2,{"$f":"IFERROR(IF(OR(O1362<>\"\",AZ1362<>\"\"),\"GS\",\"G\"),\"GS\")","v":"G"},null,null,null,null,null,"R505",{"$f":"COLUMN(O1362)&\";L:\"&COLUMN(AB1362)&\";L:\"&COLUMN(AF1362)&\";L:\"&COLUMN(AJ1362)&\";L:\"&COLUMN(AN1362)&\";L:\"&COLUMN(AR1362)","v":"15;L:28;L:32;L:36;L:40;L:44"},null,null,null,1,null,null,null,null,null,null,null,null,null,null,null,null,null,null,null,null,null,null,null,null,null,null,null,null,null,null,null,null,null,null,null,null,null,null,null,null,1]
[null,2,"G",null,null,null,null,null,"R505","15;L:28;L:32;L:36;L:40;L:44",null,null,null,2,null,null,null,null,null,null,null,null,null,null,null,null,null,null,null,null,null,null,null,null,null,null,null,null,null,null,null,null,null,null,null,null,null,null,null,null,2]
[null,2,"G",null,null,null,null,null,"R505","15;L:28;L:32;L:36;L:40;L:44",null,null,null,3,null,null,null,null,null,null,null,null,null,null,null,null,null,null,null,null,null,null,null,null,null,null,null,null,null,null,null,null,null,null,null,null,null,null,null,null,3]
[null,2,"G",null,null,null,null,null,"R505","15;L:28;L:32;L:36;L:40;L:44",null,null,null,4,null,null,null,null,null,null,null,null,null,null,null,null,null,null,null,null,null,null,null,null,null,null,null,null,null,null,null,null,null,null,null,null,null,null,null,null,4]
[null,2,"G",null,null,null,null,null,"R505","15;L:28;L:32;L:36;L:40;L:44",null,null,null,5,null,null,null,null,null,null,null,null,null,null,null,null,null,null,null,null,null,null,null,null,null,null,null,null,null,null,null,null,null,null,null,null,null,null,null,null,5]
[null,2,"G",null,null,null,null,null,"R505","15;L:28;L:32;L:36;L:40;L:44",null,null,null,6,null,null,null,null,null,null,null,null,null,null,null,null,null,null,null,null,null,null,null,null,null,null,null,null,null,null,null,null,null,null,null,null,null,null,null,null,6]
[null,2,"G",null,null,null,null,null,"R505","15;L:28;L:32;L:36;L:40;L:44",null,null,null,7,null,null,null,null,null,null,null,null,null,null,null,null,null,null,null,null,null,null,null,null,null,null,null,null,null,null,null,null,null,null,null,null,null,null,null,null,7]
[null,2,"G",null,null,null,null,null,"R505","15;L:28;L:32;L:36;L:40;L:44",null,null,null,8,null,null,null,null,null,null,null,null,null,null,null,null,null,null,null,null,null,null,null,null,null,null,null,null,null,null,null,null,null,null,null,null,null,null,null,null,8]
[null,2,"G",null,null,null,null,null,"R505","15;L:28;L:32;L:36;L:40;L:44",null,null,null,9,null,null,null,null,null,null,null,null,null,null,null,null,null,null,null,null,null,null,null,null,null,null,null,null,null,null,null,null,null,null,null,null,null,null,null,null,9]
[null,2,"G",null,null,null,null,null,"R505","15;L:28;L:32;L:36;L:40;L:44",null,null,null,10,null,null,null,null,null,null,null,null,null,null,null,null,null,null,null,null,null,null,null,null,null,null,null,null,null,null,null,null,null,null,null,null,null,null,null,null,10]
[null,2,{"$f":"C1361","v":""},null,null,null,null,null,null,null,null,null,null,null,null,null,null,null,null,null,null,null,null,null,null,null,"Kopā",{"$f":"SUM(AB1362:AE1371)","v":0},null,null,null,{"$f":"SUM(AF1362:AI1371)","v":0},null,null,null,{"$f":"SUM(AJ1362:AM1371)","v":0},null,null,null,{"$f":"SUM(AN1362:AQ1371)","v":0},null,null,null,{"$f":"SUM(AR1362:AU1371)","v":0},null,null,null,null,null,null,null,null,null,null,null,null,null,null,null,null,null,null,null,"Kopā",{"$f":"SUM(BM1362:BP1371)","v":0},null,null,null,{"$f":"SUM(BQ1362:BT1371)","v":0},null,null,null,{"$f":"SUM(BU1362:BX1371)","v":0},null,null,null,{"$f":"SUM(BY1362:CB1371)","v":0},null,null,null,{"$f":"SUM(CC1362:CF1371)","v":0}]
[null,2,{"$f":"C1361","v":""}]
[null,4,{"$f":"C1375","v":""}]
[null,4,{"$f":"C1376","v":""},null,null,null,"x",null,null,null,null,null,null,"5.6.","Informācija par zvērinātam revidentam (vai sabiedrībai) aprēķināto atlīdzību",null,null,null,null,null,null,null,null,null,null,null,null,null,null,null,null,null,null,null,null,null,null,null,null,null,null,null,null,null,null,null,null,null,null,null,"5.6.","Informācija par zvērinātam revidentam (vai sabiedrībai) aprēķināto atlīdzību"]
[null,4,{"$f":"IF(C1377=\"GS\",\"S\",\"\")","v":""},null,null,null,null,null,null,null,null,null,null,null,"Izdevumu veids",null,null,null,null,null,null,null,null,null,null,null,null,null,null,null,null,null,null,null,null,null,null,null,null,null,null,null,null,"Summa",null,null,null,null,null,null,null,"Izdevumu veids",null,null,null,null,null,null,null,null,null,null,null,null,null,null,null,null,null,null,null,null,null,null,null,null,null,null,null,null,"Summa"]
[null,4,{"$f":"IFERROR(IF(OR(AR1377<>\"\",CC1377<>\"\"),\"GS\",\"G\"),\"GS\")","v":"G"},null,null,null,null,null,"R506",{"$f":"COLUMN(O1377)&\";L:\"&COLUMN(AR1377)","v":"15;L:44"},null,null,null,1,null,null,null,null,null,null,null,null,null,null,null,null,null,null,null,null,null,null,null,null,null,null,null,null,null,null,null,null,null,null,null,null,null,null,null,null,1,"Gada pārskata obligātā revīzija (pārbaude)"]
[null,4,{"$f":"IFERROR(IF(OR(AR1378<>\"\",CC1378<>\"\"),\"GS\",\"G\"),\"GS\")","v":"G"},null,null,null,null,null,"R506","15;L:44",null,null,null,2,null,null,null,null,null,null,null,null,null,null,null,null,null,null,null,null,null,null,null,null,null,null,null,null,null,null,null,null,null,null,null,null,null,null,null,null,2,"Citu revīzijas uzdevumu veikšana"]
[null,4,"G",null,null,null,null,null,"R506","15;L:44",null,null,null,3,null,null,null,null,null,null,null,null,null,null,null,null,null,null,null,null,null,null,null,null,null,null,null,null,null,null,null,null,null,null,null,null,null,null,null,null,3,"Konsultācijas nodokļu jautājumos"]
[null,4,"G",null,null,null,null,null,"R506","15;L:44",null,null,null,4,null,null,null,null,null,null,null,null,null,null,null,null,null,null,null,null,null,null,null,null,null,null,null,null,null,null,null,null,null,null,null,null,null,null,null,null,4,"Citu lietpratēja uzdevumu veikšana"]
[null,4,"G",null,null,null,null,null,"R506","15;L:44",null,null,null,5,null,null,null,null,null,null,null,null,null,null,null,null,null,null,null,null,null,null,null,null,null,null,null,null,null,null,null,null,null,null,null,null,null,null,null,null,5]
[null,4,"G",null,null,null,null,null,"R506","15;L:44",null,null,null,6,null,null,null,null,null,null,null,null,null,null,null,null,null,null,null,null,null,null,null,null,null,null,null,null,null,null,null,null,null,null,null,null,null,null,null,null,6]
[null,4,"G",null,null,null,null,null,"R506","15;L:44",null,null,null,7,null,null,null,null,null,null,null,null,null,null,null,null,null,null,null,null,null,null,null,null,null,null,null,null,null,null,null,null,null,null,null,null,null,null,null,null,7]
[null,4,"G",null,null,null,null,null,"R506","15;L:44",null,null,null,8,null,null,null,null,null,null,null,null,null,null,null,null,null,null,null,null,null,null,null,null,null,null,null,null,null,null,null,null,null,null,null,null,null,null,null,null,8]
[null,4,"G",null,null,null,null,null,"R506","15;L:44",null,null,null,9,null,null,null,null,null,null,null,null,null,null,null,null,null,null,null,null,null,null,null,null,null,null,null,null,null,null,null,null,null,null,null,null,null,null,null,null,9]
[null,4,"G",null,null,null,null,null,"R506","15;L:44",null,null,null,10,null,null,null,null,null,null,null,null,null,null,null,null,null,null,null,null,null,null,null,null,null,null,null,null,null,null,null,null,null,null,null,null,null,null,null,null,10]
[null,4,{"$f":"C1376","v":""},null,null,null,null,null,null,null,null,null,null,null,null,null,null,null,null,null,null,null,null,null,null,null,null,null,null,null,null,null,null,null,null,null,null,null,null,null,null,null,"Kopā",{"$f":"SUM(AR1377:AU1386)","v":0},null,null,null,null,null,null,null,null,null,null,null,null,null,null,null,null,null,null,null,null,null,null,null,null,null,null,null,null,null,null,null,null,null,null,null,"Kopā",{"$f":"SUM(CC1377:CF1386)","v":0}]
[null,4,{"$f":"C1387","v":""}]
[null,2,{"$f":"C1390","v":""},null,"x","x","x",null,null,null,null,null,null,"5.7.","Paskaidrojums par PZA iekļautajām ilgtermiņa ieguldījumu vērtības samazinājuma korekcijām, ja tās nav atsevišķi norādītas PZA",null,null,null,null,null,null,null,null,null,null,null,null,null,null,null,null,null,null,null,null,null,null,null,null,null,null,null,null,null,null,null,null,null,null,null,"5.7.","Paskaidrojums par PZA iekļautajām ilgtermiņa ieguldījumu vērtības samazinājuma korekcijām, ja tās nav atsevišķi norādītas PZA"]
[null,2,{"$f":"C1391","v":""},null,null,null,null,null,null,null,null,null,null,null,"Objekts vai pamatlīdzekļu grupa vai postenis",null,null,null,null,null,null,null,null,null,null,null,null,null,null,null,null,null,null,null,null,"Bilances vērtība pārskata perioda sākumā",null,null,null,"Vērtības samazinājums, kas iekļauts PZA",null,null,null,"Bilances vērtība pārskata perioda beigās",null,null,null,null,null,null,null,"Objekts vai pamatlīdzekļu grupa vai postenis",null,null,null,null,null,null,null,null,null,null,null,null,null,null,null,null,null,null,null,null,"Bilances vērtība pārskata perioda sākumā",null,null,null,"Vērtības samazinājums, kas iekļauts PZA",null,null,null,"Bilances vērtība pārskata perioda beigās"]
[null,2,{"$f":"C1392","v":""}]
[null,2,{"$f":"IF(C1393=\"GS\",\"S\",\"\")","v":""}]
[null,2,{"$f":"IFERROR(IF(OR(O1393<>\"\",AZ1393<>\"\"),\"GS\",\"G\"),\"GS\")","v":"G"},null,null,null,null,null,"R507",{"$f":"COLUMN(O1393)&\";L:\"&COLUMN(AJ1393)&\";L:\"&COLUMN(AN1393)&\";L:\"&COLUMN(AR1393)","v":"15;L:36;L:40;L:44"},null,null,null,1,null,null,null,null,null,null,null,null,null,null,null,null,null,null,null,null,null,null,null,null,null,null,null,null,null,null,null,null,null,null,null,null,null,null,null,null,1]
[null,2,"G",null,null,null,null,null,"R507","15;L:36;L:40;L:44",null,null,null,2,null,null,null,null,null,null,null,null,null,null,null,null,null,null,null,null,null,null,null,null,null,null,null,null,null,null,null,null,null,null,null,null,null,null,null,null,2]
[null,2,"G",null,null,null,null,null,"R507","15;L:36;L:40;L:44",null,null,null,3,null,null,null,null,null,null,null,null,null,null,null,null,null,null,null,null,null,null,null,null,null,null,null,null,null,null,null,null,null,null,null,null,null,null,null,null,3]
[null,2,"G",null,null,null,null,null,"R507","15;L:36;L:40;L:44",null,null,null,4,null,null,null,null,null,null,null,null,null,null,null,null,null,null,null,null,null,null,null,null,null,null,null,null,null,null,null,null,null,null,null,null,null,null,null,null,4]
[null,2,"G",null,null,null,null,null,"R507","15;L:36;L:40;L:44",null,null,null,5,null,null,null,null,null,null,null,null,null,null,null,null,null,null,null,null,null,null,null,null,null,null,null,null,null,null,null,null,null,null,null,null,null,null,null,null,5]
[null,2,"G",null,null,null,null,null,"R507","15;L:36;L:40;L:44",null,null,null,6,null,null,null,null,null,null,null,null,null,null,null,null,null,null,null,null,null,null,null,null,null,null,null,null,null,null,null,null,null,null,null,null,null,null,null,null,6]
[null,2,"G",null,null,null,null,null,"R507","15;L:36;L:40;L:44",null,null,null,7,null,null,null,null,null,null,null,null,null,null,null,null,null,null,null,null,null,null,null,null,null,null,null,null,null,null,null,null,null,null,null,null,null,null,null,null,7]
[null,2,"G",null,null,null,null,null,"R507","15;L:36;L:40;L:44",null,null,null,8,null,null,null,null,null,null,null,null,null,null,null,null,null,null,null,null,null,null,null,null,null,null,null,null,null,null,null,null,null,null,null,null,null,null,null,null,8]
[null,2,"G",null,null,null,null,null,"R507","15;L:36;L:40;L:44",null,null,null,9,null,null,null,null,null,null,null,null,null,null,null,null,null,null,null,null,null,null,null,null,null,null,null,null,null,null,null,null,null,null,null,null,null,null,null,null,9]
[null,2,"G",null,null,null,null,null,"R507","15;L:36;L:40;L:44",null,null,null,10,null,null,null,null,null,null,null,null,null,null,null,null,null,null,null,null,null,null,null,null,null,null,null,null,null,null,null,null,null,null,null,null,null,null,null,null,10]
[null,2,{"$f":"C1404","v":""}]
[null,2,{"$f":"IF(C1405=\"GS\",\"S\",\"\")","v":""},null,null,null,null,null,null,null,null,null,null,"Papildus sniegtā informācija, ja tāda ir",null,null,null,null,null,null,null,null,null,null,null,null,null,null,null,null,null,null,null,null,null,null,null,null,null,null,null,null,null,null,null,null,null,null,null,null,"Papildus sniegtā informācija, ja tāda ir"]
[null,2,{"$f":"IFERROR(IF(OR(N1405<>\"\",AY1405<>\"\"),\"GS\",\"G\"),\"GS\")","v":"G"},null,null,null,null,null,"R50701",{"$f":"COLUMN(N1405)","v":14},{"$f":"LEFT(IF(LEN(N1405)<LEN(AY1405),AY1405,N1405),LEN(IF(LEN(N1405)<LEN(AY1405),AY1405,N1405))/2)","v":""},null,null,null,null,null,null,null,null,null,null,null,null,null,null,null,null,null,null,null,null,null,null,null,null,null,null,null,null,null,null,null,null,null,null,null,null,null,null,null,null,null,null,null,null,null,null,null,null,null,null,null,null,null,null,null,null,null,null,null,null,null,null,null,null,null,null,null,null,null,null,null,null,null,null,null,"x"]
[null,2,{"$f":"C1405","v":"G"},null,null,null,null,null,null,{"$f":"COLUMN(N1406)","v":14},{"$f":"RIGHT(IF(LEN(N1405)<LEN(AY1405),AY1405,N1405),LEN(IF(LEN(N1405)<LEN(AY1405),AY1405,N1405))/2)","v":""}]
[null,1]
[null,1,null,"x","x","x","x",null,null,null,null,null,null,"6.","Informācija par posteņu pārklasifikāciju",null,null,null,null,null,null,null,null,null,null,null,null,null,null,null,null,null,null,null,null,null,null,null,null,null,null,null,null,null,null,null,null,null,null,null,"6.","Informācija par posteņu pārklasifikāciju"]
[null,1]
[null,1,null,null,null,null,null,null,null,null,null,null,null,null,"Postenis, no kura veikta pārklasifikācija",null,null,null,null,null,null,null,null,null,null,null,null,null,null,"Postenis, uz kuru veikta pārklasifikācija",null,null,null,null,null,null,null,null,null,null,null,null,null,"Pārklasificētā summa",null,null,null,null,null,null,null,"Postenis, no kura veikta pārklasifikācija",null,null,null,null,null,null,null,null,null,null,null,null,null,null,"Postenis, uz kuru veikta pārklasifikācija",null,null,null,null,null,null,null,null,null,null,null,null,null,"Pārklasificētā summa"]
[null,1,{"$f":"IF(C1412=\"GS\",\"S\",\"\")","v":""}]
[null,1,{"$f":"IFERROR(IF(OR(O1412<>\"\",AZ1412<>\"\"),\"GS\",\"G\"),\"GS\")","v":"G"},null,null,null,null,null,"R6",{"$f":"COLUMN(O1412)&\";\"&COLUMN(AD1412)&\";L:\"&COLUMN(AR1412)","v":"15;30;L:44"},null,null,null,1,null,null,null,null,null,null,null,null,null,null,null,null,null,null,null,null,null,null,null,null,null,null,null,null,null,null,null,null,null,null,null,null,null,null,null,null,1]
[null,1,"G",null,null,null,null,null,"R6","15;30;L:44",null,null,null,2,null,null,null,null,null,null,null,null,null,null,null,null,null,null,null,null,null,null,null,null,null,null,null,null,null,null,null,null,null,null,null,null,null,null,null,null,2]
[null,1,"G",null,null,null,null,null,"R6","15;30;L:44",null,null,null,3,null,null,null,null,null,null,null,null,null,null,null,null,null,null,null,null,null,null,null,null,null,null,null,null,null,null,null,null,null,null,null,null,null,null,null,null,3]
[null,1,"G",null,null,null,null,null,"R6","15;30;L:44",null,null,null,4,null,null,null,null,null,null,null,null,null,null,null,null,null,null,null,null,null,null,null,null,null,null,null,null,null,null,null,null,null,null,null,null,null,null,null,null,4]
[null,1,"G",null,null,null,null,null,"R6","15;30;L:44",null,null,null,5,null,null,null,null,null,null,null,null,null,null,null,null,null,null,null,null,null,null,null,null,null,null,null,null,null,null,null,null,null,null,null,null,null,null,null,null,5]
[null,1,"G",null,null,null,null,null,"R6","15;30;L:44",null,null,null,6,null,null,null,null,null,null,null,null,null,null,null,null,null,null,null,null,null,null,null,null,null,null,null,null,null,null,null,null,null,null,null,null,null,null,null,null,6]
[null,1,"G",null,null,null,null,null,"R6","15;30;L:44",null,null,null,7,null,null,null,null,null,null,null,null,null,null,null,null,null,null,null,null,null,null,null,null,null,null,null,null,null,null,null,null,null,null,null,null,null,null,null,null,7]
[null,1,"G",null,null,null,null,null,"R6","15;30;L:44",null,null,null,8,null,null,null,null,null,null,null,null,null,null,null,null,null,null,null,null,null,null,null,null,null,null,null,null,null,null,null,null,null,null,null,null,null,null,null,null,8]
[null,1,"G",null,null,null,null,null,"R6","15;30;L:44",null,null,null,9,null,null,null,null,null,null,null,null,null,null,null,null,null,null,null,null,null,null,null,null,null,null,null,null,null,null,null,null,null,null,null,null,null,null,null,null,9]
[null,1,"G",null,null,null,null,null,"R6","15;30;L:44",null,null,null,10,null,null,null,null,null,null,null,null,null,null,null,null,null,null,null,null,null,null,null,null,null,null,null,null,null,null,null,null,null,null,null,null,null,null,null,null,10]
[null,1]
[null,1,{"$f":"C1424","v":""},"x","x","x","x",null,null,null,null,null,null,"7.","Papildinformācija par PZA posteņiem, ja tāda nepieciešama patiesa un skaidra priekšstata gūšanai",null,null,null,null,null,null,null,null,null,null,null,null,null,null,null,null,null,null,null,null,null,null,null,null,null,null,null,null,null,null,null,null,null,null,null,"7.","Papildinformācija par PZA posteņiem, ja tāda nepieciešama patiesa un skaidra priekšstata gūšanai"]
[null,1,{"$f":"IF(C1425=\"GS\",\"S\",\"\")","v":""}]
[null,1,{"$f":"IFERROR(IF(OR(N1425<>\"\",AY1425<>\"\"),\"GS\",\"G\"),\"GS\")","v":"G"},null,null,null,null,null,"R7",{"$f":"COLUMN(N1425)","v":14},{"$f":"LEFT(IF(LEN(N1425)<LEN(AY1425),AY1425,N1425),LEN(IF(LEN(N1425)<LEN(AY1425),AY1425,N1425))/2)","v":""},null,null,null,null,null,null,null,null,null,null,null,null,null,null,null,null,null,null,null,null,null,null,null,null,null,null,null,null,null,null,null,null,null,null,null,null,null,null,null,null,null,null,null,null,null,null,null,null,null,null,null,null,null,null,null,null,null,null,null,null,null,null,null,null,null,null,null,null,null,null,null,null,null,null,null,"x"]
[null,1,{"$f":"C1425","v":"G"},null,null,null,null,null,null,{"$f":"COLUMN(N1426)","v":14},{"$f":"RIGHT(IF(LEN(N1425)<LEN(AY1425),AY1425,N1425),LEN(IF(LEN(N1425)<LEN(AY1425),AY1425,N1425))/2)","v":""}]

{"sheet":"Šabloni pielikumiem","index":12,"n_rows":34,"n_cols":3,"rows_kept":34,"cut":false,"hidden":true,"merged":[]}
[]
[null,"Nr.","Teksta paraugs"]
[null,"1.3.","Naudas plūsmas pārskats sagatavots pēc netiešās / (tiešās metodes). \nNaudas plūsmas pārskata mērķiem nauda un naudas ekvivalenti sastāv no atlikumiem naudas kasē, tekošo bankas kontu atlikumiem un īstermiņa depozītiem ar termiņu līdz 90 dienām."]
[null,"1.4.","Elektroniskajā deklarēšanas sistēmā  (EDS) ievadītais gada pārskata  atvasinājums elektroniskā formā pēc sniegtās informācijas satura atbilst Sabiedrības sagatavotajam pilnajam gada pārskatam, tomēr EDS pielikumā informācija ir sniegta citā griezumā, tā neietver pilnībā visu gada pārskata pielikumā iekļauto informāciju un tādējādi EDS sniegtā informācija nav tieši salīdzināma ar pilnajā gada pārskatā iekļauto finanšu pārskata informāciju, ko revidējis zvērināts revidents un par kuru tika izsniegts zvērināta revidenta ziņojums. \nPilnu Sabiedrības gada pārskatu par 2019. gadu kopā ar zvērināta revidenta ziņojumu par gada pārskatā iekļauto finanšu pārskatu lūdzu skatīt ieskenētā veidā  pievienotajā pielikumā."]
[null,"1.4.","Sabiedrības finanšu pārskati ir sagatavoti saskaņā ar Latvijas Republikas likumiem “Par grāmatvedību”, “Gada pārskatu un konsolidēto gada pārskatu likums”, un MK noteikumiem Nr.775 “Gada pārskatu un konsolidēto gada pārskatu likuma piemērošanas noteikumi”.  Finanšu pārskatā par naudas vienību lietota Latvijas Republikas naudas vienība euro (Eur). Finanšu pārskats sagatavots atbilstoši šādiem vispārīgajiem principiem:\n•\tpieņem, ka sabiedrība darbosies arī turpmāk (darbības turpināšanas princips);\n•\tizmanto to pašu grāmatvedības politiku un novērtēšanas metodes, kuras izmantotas iepriekšējā pārskata gadā;\n•\tfinanšu pārskatā posteņus atzīst un novērtē, izmantojot piesardzības principu, jo īpaši ievērojot šādus nosacījumus:\na) finanšu pārskatā iekļauj tikai līdz bilances datumam iegūto peļņu,\nb) ņem vērā visas saistības, kā arī paredzamās riska summas un zaudējumus, kas radušies pārskata gadā vai iepriekšējos gados, arī tad, ja tie kļuvuši zināmi laikposmā starp bilances datumu un dienu, kad gada pārskatu paraksta vadība, pilnvarotā persona vai pārvaldes institūcija,\nc) aprēķina un ņem vērā visas aktīvu vērtības samazināšanās un nolietojuma summas neatkarīgi no tā, vai pārskata gads tiek noslēgts ar peļņu vai zaudējumiem;\n•\tbilances un peļņas vai zaudējumu aprēķina posteņos summas norāda pēc uzkrāšanas principa, proti, ieņēmumus un izdevumus norāda, ņemot vērā to rašanās laiku, nevis naudas saņemšanas vai izdošanas laiku. Ar pārskata gadu saistītos ieņēmumus un izdevumus norāda neatkarīgi no maksājuma vai rēķina saņemšanas datuma;\n•\tizmaksas saskaņo ar ieņēmumiem attiecīgajos pārskata periodos;\n•\tbilances aktīva un pasīva posteņus novērtē atsevišķi;\n•\tjebkāds ieskaits starp bilances aktīva un pasīva posteņiem vai peļņas vai zaudējumu aprēķina ieņēmumu un izdevumu posteņiem ir aizliegts,\n•\t ja tiek izslēgts atsavināts vai likvidēts ilgtermiņa ieguldījumu objekts, savstarpēji ieskaita ar minētā objekta izslēgšanu saistītos ieņēmumus un izmaksas. Peļņas vai zaudējumu aprēķinā norāda neto vērtību — peļņu vai zaudējumus no ilgtermiņa ieguldījumu objekta atsavināšanas, kuru aprēķina kā starpību starp izslēgtā objekta bilances vērtību un tā atsavināšanas vai likvidācijas ieņēmumiem un izdevumiem ar nosacījumu, ka finanšu pārskata pielikumā ir norādītas bruto summas;\n•\tbilances un peļņas vai zaudējumu aprēķina posteņos summas norāda, ņemot vērā saimniecisko darījumu saturu un būtību, nevis tikai juridisko formu;\n•\tbilances un peļņas vai zaudējumu aprēķina posteņus novērtē atbilstīgi iegādes izmaksām vai ražošanas pašizmaksai. Iegādes izmaksas ir preces vai pakalpojuma pirkšanas cena (atskaitot saņemtās atlaides), kurai pieskaitīti ar pirkumu saistītie papildu izdevumi. Ražošanas pašizmaksa ir izejvielu, pamatmateriālu un palīgmateriālu iegādes izmaksas un citi izdevumi, kas ir tieši saistīti ar attiecīgā objekta izgatavošanu. Ražošanas pašizmaksā drīkst iekļaut arī tādu izmaksu daļas, kas ir netieši saistītas ar objekta izgatavošanu, ja vien šīs izmaksas ir attiecināmas uz to pašu laikposmu.\nBilances un/, peļņas vai zaudējumu aprēķina, naudas plūsmas pārskata un pašu kapitāla izmaiņu pārskata konkrētajos posteņos norādīta nozīmīga finanšu informācija, kura būtiski ietekmē gada pārskata lietotāju novērtējumu vai lēmumu pieņemšanu. Maznozīmīgas summas, kuras būtiski neietekmē gada pārskata lietotāju novērtējumu vai lēmumu pieņemšanu, minētajās finanšu pārskata sastāvdaļās norādīta attiecīgos līdzīgu finanšu informāciju apvienojošajos posteņos, šo summu detalizējums sniegts tālāk finanšu pārskata pielikumā."]
[null,"1.4.","Aplēšu izmantošana \nFinanšu pārskatu sagatavošanā sabiedrības valde veikusi vairākas aplēses un pieņēmumus, kas ietekmē atsevišķus finanšu pārskatos ietverto bilances un ieņēmumu un izdevumu pārskata posteņu atlikumu, kā arī iespējamo saistību apmēru. Notikumi nākotnē var ietekmēt minētās aplēses un pieņēmumus. Jebkāda šādu aplēšu un pieņēmumu maiņas ietekme uz sabiedrības darbības rezultātiem tiek uzrādīta finanšu pārskatos tā noteikšanas brīdī."]
[null,"1.4.","Ārvalstu valūtu pārvērtēšana euro\nVisi darījumi ārvalstu valūtās ir pārvērsti euro saskaņā ar grāmatvedībā izmantojamo ārvalstu valūtas kursu, kas ir spēkā darījuma datumā dienas sākumā.\nVisi monetārie aktīvi ārvalstu valūtā pārskata perioda beigās tiek pārvērtēti euro (Eur) saskaņā ar grāmatvedībā izmantojamo ārvalstu valūtas kursu, kas ir spēkā bilances datumā 31. decembrī dienas beigās un attiecīgās valūtu kursu starpības ir atspoguļotas peļņas vai zaudējumu aprēķinā.\nĀrvalstu valūtu kursi pārskata perioda beigās pēdējo divu gadu laikā bija sekojoši:"]
[null,"1.4.","Ilgtermiņa ieguldījumu pārvērtēšana \nAtkāpjoties no likuma “Gada pārskatu un konsolidēto gada pārskatu likums” normām pamatlīdzekļu objektu, kura vērtība ir būtiski lielāka par tā iegādes izmaksām vai ražošanas pašizmaksu, vai novērtējumu iepriekšējā gada bilancē, var pārvērtēt atbilstoši augstākai vērtībai, ja var pieņemt, ka vērtības paaugstinājums būs ilgstošs. Pārvērtēšanas rezultātā radušos starpību starp novērtējumu, kas veikts, pamatojoties uz iegādes izmaksām vai ražošanas pašizmaksu, un novērtējumu, kas veikts, pamatojoties uz pārvērtēšanu, ja šī starpība ir pozitīva (turpmāk — vērtības pieaugums), iekļauj attiecīgajā bilances aktīva postenī, kurā norādīts pārvērtētais pamatlīdzekļu objekts, un bilances pasīva postenī \"Ilgtermiņa ieguldījumu pārvērtēšanas rezerve\" iedaļā \"Pašu kapitāls\". Ilgtermiņa ieguldījumu pārvērtēšanas rezervē neiekļauj summu, kuras apmērā pārvērtēšanas rezultātā radies vērtības pieaugums pilnībā vai daļēji kompensē tā paša pamatlīdzekļu objekta vērtības samazinājuma korekcijas, kas iepriekšējos pārskata gados bija ietvertas peļņas vai zaudējumu aprēķinā kā izmaksas. Šo summu ietver peļņas vai zaudējumu aprēķinā kā ieņēmumus tajā pārskata gadā, kurā konstatēts pamatlīdzekļu objekta vērtības pieaugums.\nPārvērtētā pamatlīdzekļu objekta ikgadējo nolietojumu kārtējā pārskata gadā aprēķina, pamatojoties uz šā objekta vērtību attiecīgajā pārskata gadā, un tādās pašās summās ietver peļņas vai zaudējumu aprēķinā kā izmaksas.\nIlgtermiņa ieguldījumu pārvērtēšanas rezervi samazina, ja pārvērtētais pamatlīdzekļu objekts ir atsavināts, likvidēts vai tā vērtības palielināšanai vairs nav pamata vai ja veic pārvērtētā pamatlīdzekļu objekta ikgadējo nolietojuma aprēķināšanu. Pārvērtēšanas rezerves samazinājumu ietver peļņas vai zaudējumu aprēķinā kā ieņēmumus tajā pārskata gadā, kurā šāds samazinājums veikts.\nIlgtermiņa ieguldījumu pārvērtēšanas rezervi neizmaksā, nesadala dividendēs un neizlietot zaudējumu segšanai, pamatkapitāla palielināšanai, citu rezervju veidošanai vai citiem mērķiem"]
[null,"1.4.","Ilgtermiņa ieguldījumi nomātajos pamatlīdzekļos\nNomāto pamatlīdzekļu kapitālā remonta izmaksas tiek norakstītas pēc lineārās metodes īsākajā no kapitālo uzlabojumu lietderīgās izmantošanas laika un nomas perioda."]
[null,"1.4.","Uzkrātās saistības\nBilances postenī \"Uzkrātās saistības\" norāda skaidri zināmās saistību summas pret preču piegādātājiem un pakalpojumu sniedzējiem par pārskata gadā saņemtajām precēm vai pakalpojumiem, par kuriem piegādes, pirkuma vai līguma nosacījumu vai citu iemeslu dēļ bilances datumā vēl nav saņemts maksāšanai paredzēts attiecīgs attaisnojuma dokuments (rēķins).\nSabiedrība veido uzkrājumus saistībām pret darbiniekiem par neizmantoto atvaļinājumu. \nUzkrātās neizmantoto atvaļinājumu izmaksas tiek aplēstas, reizinot darbinieku vidējo dienas izpeļņu par pārskata gada pēdējiem sešiem mēnešiem ar pārskata gada beigās uzkrāto neizmantoto atvaļinājuma dienas skaitu."]
[null,"1.4.","Radniecīgās sabiedrības\nRadniecīgās sabiedrības ir tādas sabiedrības, kas attiecībā pret sabiedrību, ir koncerna meitas sabiedrība vai koncerna mātes sabiedrība, vai citas šā koncerna meitas sabiedrības, vai šā koncerna meitas sabiedrības meitas sabiedrība."]
[null,"1.4.","Asociētās sabiedrības\nAsociētās sabiedrības ir tādas sabiedrības, kas atrodas citas sabiedrības būtiskā ietekmē, kura tiek nodrošināta ar ne mazāk kā 20, bet ne vairāk kā 50 procentiem no akcionāru vai dalībnieku balsstiesībām šajā sabiedrībā."]
[null,"1.4.","Salīdzinošā informācija\nAtbilstoši likuma prasībām mainīti atsevišķu peļņas vai zaudējumu aprēķina un bilances posteņu nosaukumi, kā arī veikta posteņu pārklasifikācija, pārklasificējot iepriekšējā perioda salīdzinošos rādītājus atbilstoši pārskata gadā lietotajiem principiem, tādejādi pārskata perioda finanšu rādītāji ir savstarpēji salīdzināmi:"]
[null,"1.4.","Salīdzinošā informācija\nFinanšu pārskata rādītāji nav salīdzināmi ar iepriekšējo periodu, jo iepriekšējais periods ir par 8 mēnešiem, bet pārskata periods ir par 12 mēnešiem."]
[null,"1.4.","Konsolidētais gada pārskats, informācija par koncerna mātes sabiedrību un piemēroto atbrīvojumu nesagatavot konsolidēto gada pārskatu\nKoncerna mātes sabiedrība piemēro atbrīvojumu no pienākuma sagatavot konsolidēto gada pārskatu, jo tā ir maza koncerna mātes sabiedrība un tās meitas sabiedrību pārvedama vērtspapīri nav iekļauti regulētajā tirgū.\n\nMātes sabiedrība ir atbrīvota no pienākuma sagatavot konsolidēto gada pārskatu, jo tai ir tikai tādas meitas sabiedrības, par kurām informācija gan par katru atsevišķi, gan kā par kopumu, ir nenozīmīga un, kuras izslēdzot no konsolidācijas mātes sabiedrības pārskats kā koncerna pārskats sniedz patiesu un skaidru priekšstatu par šā koncerna darbības rezultātiem un finansiālo stāvokli.\n"]
[null,"1.4.1.1.","Nemateriālie ieguldījumi \nNemateriālie ieguldījumi galvenokārt sastāv no par atlīdzību iegūtām lietošanas tiesībām, licencēm, patentiem, koncesijām un tam līdzīgām tiesībām. Nemateriālie ieguldījumi tiek novērtēti pēc to sākotnējās izmaksu vērtības, atskaitot uzkrāto nolietojumu. Nolietojums tiek aprēķināts pēc lineārās metodes, pielietojot 33,33% nolietojuma likmi gadā. Izņēmuma gadījumā, ja nemateriālās vērtības vai attīstības izmaksu objekta lietderīgās lietošanas laiku nav iespējams ticami aplēst, to sākotnējo vērtību noraksta pakāpeniski, sadalot pa gadiem laikposmā, kas nav ilgāks par 10 gadiem (katru šādu gadījumu paskaidro finanšu pārskata pielikumā, norādot laikposma ilgumu, kurā paredzēts norakstīt attiecīgā posteņa sākotnējo vērtību)."]
[null,"1.4.1.2.","Pamatlīdzekļi\nPamatlīdzekļi tiek novērtēti pēc to sākotnējās izmaksu vērtības vai pārvērtētās sākotnējās vērtības, atskaitot uzkrāto nolietojumu. Nolietojums tiek aprēķināts pēc lineārās/ ģeometriski degresīvās metodes, pielietojot sekojošas  vadības noteiktas pamatlīdzekļu nolietojuma aprēķināšanas likmes, kas balstītas uz pamatlīdzekļu lietderīgās kalpošanas laika novērtējumu, attiecībā uz finanšu uzskaitē esošo pamatlīdzekļu iedalījumu kategorijās: \n\nTabula\n\nAktīvu aplēstās atlikušās vērtības un lietderīgās izmantošanas periodi tiek pārskatīti un nepieciešamības gadījumā koriģēti katrā pārskata datumā.\nSabiedrība kapitalizē pamatlīdzekļus, kuru vērtība pārsniedz Eur _____ un derīgās lietošanas laiks pārsniedz 1 gadu. \nPamatlīdzekļu kārtējā remonta un uzturēšanas izmaksas tiek iekļautas tā perioda peļņas vai zaudējumu aprēķinā, kurā tās ir radušās.\nPamatlīdzekļu objektu uzskaites vērtības atzīšanu pārtrauc, ja tas tiek atsavināts vai gadījumā, kad no aktīva turpmākās lietošanas nākotnē nav gaidāmi nekādi saimnieciskie labumi.\nNepabeigtā celtniecība atspoguļo pamatlīdzekļu izveidošanas un nepabeigto celtniecības objektu izmaksas, un tā tiek uzskaitīta sākotnējā vērtībā. Sākotnējā vērtībā ietilpst celtniecības izmaksas un citas tiešās izmaksas. Nepabeigtajai celtniecībai nolietojums netiek aprēķināts, kamēr attiecīgie aktīvi nav pabeigti un nodoti ekspluatācijā.\nSabiedrība iekļauj pamatlīdzekļu izveidošanas izmaksās saņemto aizņēmumu, kas izmantoti aktīvu izveidei, procentu izmaksas. "]
[null,"1.4.1.3.","Ieguldījumi koncerna meitas un asociētajās sabiedrībās, citi ieguldījumi\nIlgtermiņa ieguldījumi, ieskaitot ieguldījumus koncerna meitas un asociētajās sabiedrībās, tiek uzskaitīti iegādes vērtībā, kuru koriģē to vērtības ilgstošas palielināšanās vai samazināšanās gadījumos."]
[null,"1.4.2.1.","Krājumi\nIzejvielas, materiāli un preces pārdošanai gada pārskatā tiek novērtēti pēc vidējās svērtās cenas vai FIFO metodes (pirmais iekšā, pirmais ārā).\nSabiedrība lieto vienu un to pašu krājumu izlietojuma un atlikumu vērtības noteikšanas metodi visiem līdzīga veida un lietojuma krājumiem.\nKrājumu vērtību koriģē, lai tie bilances datumā tiktu novērtēti atbilstoši iegādes izmaksām vai ražošanas pašizmaksai, vai zemākajām tirgus cenām šajā datumā, atkarībā no tā, kurš no šiem rādītājiem ir zemāks, vai īpašos gadījumos — atbilstoši neto pārdošanas vērtībai. Krājumu vērtības samazinājuma korekcijas var pārtraukt, ja vērtības samazināšanai vairs nav pamata.\nNepabeigto pasūtījumu vērtībā iekļauj materiālu, darbaspēka un citas izmaksas, kas tieši saistītas ar pakalpojumu sniegšanu, kā arī attiecināmā daļa no vispārējām pieskaitāmām izmaksām.\nSabiedrība iekļauj krājumu  izveidošanas pašizmaksā saņemto aizņēmumu, kas izmantoti aktīvu izveidei, procentu izmaksas."]
[null,"1.4.2.2.","Debitori\nDebitoru parādi novērtēti, ievērojot piesardzības principu, bilancē uzrādot tikai reālos debitorus.\nSpeciālie uzkrājumi šaubīgiem parādiem tiek veidoti gadījumos, kad pēc vadības uzskatiem šo debitoru parādu atgūšana ir apšaubāma, izvērtējot katru debitoru atsevišķi. Bezcerīgie parādi tiek norakstīti pārskata gada zaudējumos."]
[null,"1.4.2.3.","Nauda un naudas ekvivalenti \nNaudas plūsmas pārskata mērķiem nauda un naudas ekvivalenti sastāv no atlikumiem naudas kasē, tekošo bankas kontu atlikumiem un īstermiņa depozītiem ar termiņu līdz 90 dienām."]
[null,"1.4.3.","Uzkrājumi \nSabiedrība veidot uzkrājumus izdevumu segšanai, ja šo izdevumu būtība ir skaidri noteikta un to rašanās bilances datumā ir paredzama vai zināma vai kuri noteikti radīsies, bet var mainīties šo izdevumu segšanai nepieciešamās summas lielums vai to rašanās datums.\nUzkrājumus novērtē saskaņā ar precīzāko grāmatvedības aplēsi par summu, kas nepieciešama bilances datumā, lai segtu šā panta pirmajā daļā minētās saistības vai otrajā daļā minētos izdevumus, kuri varētu rasties.\nUzkrājumus nedrīkst izmantot aktīvu vērtības koriģēšanai.\nUzkrājumus pārskata katrā bilances datumā. Ja turpmāku notikumu ietekmē mainās apstākļi, kas bija par pamatu līdzšinējam uzkrājumu novērtējumam, vai ir iegūta jauna informācija, sabiedrība maina grāmatvedības aplēsi un koriģē (palielina vai samazina) attiecīgo uzkrājumu summu. Ja vairs netiek izpildīti attiecīgo uzkrājumu atzīšanas nosacījumi, tos izslēdz."]
[null,"1.4.4.","Uzkrātās saistības\nBilances postenī \"Uzkrātās saistības\" norāda skaidri zināmās saistību summas pret preču piegādātājiem un pakalpojumu sniedzējiem par pārskata gadā saņemtajām precēm vai pakalpojumiem, par kuriem piegādes, pirkuma vai līguma nosacījumu vai citu iemeslu dēļ bilances datumā vēl nav saņemts maksāšanai paredzēts attiecīgs attaisnojuma dokuments (rēķins).\nSabiedrība veido uzkrājumus saistībām pret darbiniekiem par neizmantoto atvaļinājumu. \nUzkrātās neizmantoto atvaļinājumu izmaksas tiek aplēstas, reizinot darbinieku vidējo dienas izpeļņu par pārskata gada pēdējiem sešiem mēnešiem ar pārskata gada beigās uzkrāto neizmantoto atvaļinājuma dienas skaitu."]
[null,"1.4.5.","Ieņēmumu atzīšana\nSabiedrības pamatdarbība ir...................................................................................................... \nNeto apgrozījums ir gada laikā pārdotās produkcijas un sniegto pakalpojumu vērtības kopsumma atskaitot piešķirtās atlaides un pievienotās vērtības nodokli.\nIeņēmumi tiek atzīti pēc sekojošiem principiem:\n•\tTrešās personas vārdā iekasētās summas, kuras saņem sabiedrība un kuru dēļ nepalielinās pašu kapitāls, neiekļauj ieņēmumos.\n•\tIeņēmumi no preču pārdošanas Latvijā tiek atzīti, kad pircējs ir preces akceptējis. Ieņēmumi no preču pārdošanas ārpus Latvijas tiek atzīti atbilstoši preču piegādes nosacījumiem.\n•\tIeņēmumi no pakalpojumu sniegšanas tiek atzīti atbilstoši darījuma izpildes pakāpei.\n•\tIeņēmumi no soda un kavējuma naudām tiek atzīti saņemšanas brīdī.\n•\tProcentu ieņēmumi tiek atzīti pamatojoties uz proporcionālu laika sadalījumu, ņemot vērā aktīva faktisko ienesīgumu.\n•\tDividendes tiek atzītas brīdī, kad rodas likumīgas tiesības uz tām.\n•\tAutoratlīdzību atzīst pēc uzkrāšanas principa saskaņā ar attiecīgo līgumu.                                                                                           Pārējie saimnieciskās darbības ieņēmumi ir dažādi citi ieņēmumi (piemēram, gūto peļņu no ilgtermiņa ieguldījumu objektu atsavināšanas vai no ārvalstu valūtas kursu svārstībām, ieņēmumus no saņemtajām apdrošināšanas atlīdzībām, no saņemtās finanšu palīdzības vai finansiālā atbalsta), kas nav tieši saistīti ar sabiedrības pamatdarbību, bet, kas radušies saimnieciskās darbības rezultātā vai izriet no tās."]
[null,"1.4.6.","Ar ilgtermiņa līgumu saistītie ieņēmumi\nAr līgumu saistītos ieņēmumos iekļauj:\no\tIeņēmumu sākotnējo summu, par kuru vienojas līgumā;\no\tLīgumā paredzēto darbu novirzes, prasījumu un veicināšanas maksājumu izmaiņas, ja ir ticams, ka tās radīs ieņēmumus, un ja ir iespējams tās ticami novērtēt.\n\nAr līgumu saistītos ieņēmumus novērtē saņemtās vai saņemamās atlīdzības patiesajā vērtībā.\nGaidāmo zaudējumu atzīšana\nJa ilgtermiņa līgumu rezultātu ir iespējams ticami aplēst, ar šādu līgumu saistītos ieņēmumus un izmaksas atzīst attiecīgi par ieņēmumiem un izdevumiem, ņemot vērā līgumdarba izpildes apjomu procentos bilances datumā. Ja ir ticams, ka ar līgumu saistītās kopējās izmaksas pārsniegs kopējos ieņēmumus, gaidāmos zaudējumus uzreiz atzīst par izdevumiem"]
[null,"1.4.7.","Izdevumu atzīšanas principi\nIzmaksas peļņas vai zaudējuma aprēķinā norāda pēc uzkrāšanas principa, ņemot vērā to rašanās laiku, nevis naudas izdošanas laiku. Ar pārskata saistītos izdevumus norāda neatkarīgi no maksājuma vai rēķina saņemšanas datuma. Izmaksas saskaņo ar ieņēmumiem attiecīgajos pārskata periodos."]
[null,"1.7.","Skaidrojums par atkāpšanos no likumā noteiktajiem finanšu pārskata posteņu atzīšanas,novērtēšanas un norādīšanas principiem vai noteikumiem\nSagatavojot 2019.gada pārskatu, saskaņā ar “Gada pārskatu un konsolidēto gada pārskatu likuma” normām, sabiedrība, pamatojoties uz likuma 13.panta 4. un 5.daļas nosacījumiem ir atkāpusies no finanšu pārskata posteņu atzīšanas, novērtēšanas un norādīšanas principiem, atspoguļojot finanšu pārskatā atliktā nodokļa saistības, sakarā ar to, ka bez šīs informācijas atspoguļošanas nav ievērots patiesa un skaidra priekšstata princips. Sabiedrība atlikto nodokli ir atzinusi arī iepriekšējos periodos, tā apmērs ir būtisks. Atliktā nodokļa aprēķinā un atspoguļošanā tiek izmantots Starptautiskais  grāmatvedības standarts Nr. 12. ”Ienākumu nodokļi”.\nAtliktā nodokļa aktīvi vai saistības (saskaņā ar SGS)\nPārskata gada uzņēmuma ienākuma nodokļa izmaksas ir iekļautas gada pārskatā, pamatojoties uz vadības aprēķiniem saskaņā ar Latvijas Republikas nodokļu likumdošanu.\nAtliktais nodoklis tiek aprēķināts saskaņā ar saistību metodi attiecībā uz visām pagaidu atšķirībām starp aktīvu un saistību vērtībām finanšu pārskatos un to vērtībām nodokļu aprēķinu mērķiem. \nAtliktā nodokļa aprēķinos tiek izmantota nodokļu likme, kas sagaidāma periodos, kad pagaidu atšķirības izlīdzināsies. Gadījumos, kad kopējais uzkrātā nodokļa aprēķina rezultāts būtu atspoguļojams bilances aktīvā, to iekļauj gada pārskatā tikai tad, kad tā atgūšana ir droši sagaidāma (sabiedrība iegūs ar nodokli apliekamu peļņu, uz kuru varēs attiecināt pagaidu starpības, kas veidojušas atliktā nodokļa aktīvu). \n\nPārdošanai turēti ilgtermiņa ieguldījumi (novērtēti saskaņā ar SGS)\nPamatlīdzekli, kura vērtību paredzēts atgūt to pārdodot, nevis izmantojot saimnieciskajā darbībā, un kurš nav ieguldījuma īpašums, finanšu pārskatos uzrāda atsevišķi kā pārdošanai turētu aktīvu. Pamatlīdzekli uzskata par pārdošanai paredzētu aktīvu, ja tas ir sagatavots tūlītējai pārdošanai, uzņēmuma vadība ir pieņēmusi lēmumu to pārdot un ir uzsākusi aktīvu šā lēmuma īstenošanu. Bilancē pārdošanai turētos pamatlīdzekļus iekļauj apgrozāmo līdzekļu sastāvā un novērtē zemākajā no bilances vērtības un patiesās vērtības, atskaitot izmaksas, kuras būs nepieciešamas, lai pamatlīdzekli pārdotu.\n\nIeguldījuma īpašumi (uzskaitīti un novērtēti SGS)\nIeguldījuma īpašumi ir zemes gabali, ēkas, būves vai šo objektu daļas, ko sabiedrība tur (kā īpašnieks vai kā nomnieks saskaņā ar finanšu nomu), lai iegūtu nomas (īres) maksu vai sagaidītu cenas celšanos (vērtības pieaugumu), nevis lai izmantotu paša Sabiedrība.\nĒkas un būves\t10%\n"]
[null,"1.8.8.","Noma bez izpirkuma tiesībām (operatīvā noma)\nGadījumos, kad pamatlīdzekļi tiek nomāti uz nomas bez izpirkuma tiesībām noteikumiem, nomas maksājumi un priekšapmaksas maksājumi par nomu tiek iekļauti peļņas vai zaudējuma aprēķinā pēc lineārās metodes nomas perioda laikā."]
[null,"1.8.9.","Noma ar izpirkumu (finanšu noma) \nGadījumos, kad pamatlīdzekļi, kas iegūti nomā ar izpirkumu (finanšu nomā), saistībā ar kuriem uzņēmumam pāriet visi riski un atlīdzība, kas raksturīga īpašumtiesībām, tiek uzskatīti par Sabiedrības aktīviem tādā vērtībā, par kādu tos varētu iegādāties ar tūlītējo samaksu. Līzinga procentu maksājumi un tiem pielīdzināmi maksājumi tiek iekļauti tā perioda peļņas vai zaudējumu aprēķinā, kurā tie ir radušies."]
[null,"1.10.","Būtiski notikumi pēc bilances datuma, kas neattiecas uz pārskata gadu un tāpēc nav iekļauti bilancē vai peļņas vai zaudējumu aprēķinā \nFinanšu pārskatos tiek atspoguļoti tādi notikumi pēc pārskata gada beigām, kas sniedz papildu informāciju par sabiedrības finansiālo stāvokli bilances sagatavošanas datumā (koriģējošie notikumi). Ja notikumi pēc pārskata gada beigām nav koriģējoši, tie tiek atspoguļoti finanšu pārskatu pielikumos, tikai tad, ja tie ir būtiski."]
[null,"1.14.","Pētniecības un attīstības pasākumi un pašu akcijas vai daļas \nSabiedrībai nav pētniecības un attīstības pasākumu un tā pārskata gadā nav atpirkusi savas akcijas vai daļas. "]
[null,"2.1.","Gada pārskata perioda maiņa: Saskaņā ar sabiedrības statūtiem pārskata perioda sākums mainīts no 1.janvāra uz 1.septembri. Šā pārskata gada sākuma rādītāji nav salīdzināmi, jo tie ir par 12 mēnešiem, bet pārskata gada dati ir par 4 mēnešiem. "]
[null,"5.2.","Finanšu palīdzība un atbalsts, ziedojumi un dāvinājumi \nSaņemtos finansiālos atbalstus iekļauj ieņēmumos tajā pārskata gadā kurā saņemta finanšu palīdzība vai finansiālais atbalsts. \nPamatlīdzekļu izveidošanai saņemtā finanšu palīdzība un atbalsts tiek uzskaitīts kā nākamo periodu ienākumi, kurus pakāpeniski iekļauj ieņēmumos saņemto vai par finanšu palīdzību un atbalstu iegādāto pamatlīdzekļu lietderīgās izmantošanas perioda laikā. Pārējās dotācijas attiecina uz pārskata gada rezultātiem dotāciju saņemšanas periodā.\nGadījumā ja sabiedrībai ir pamatota pārliecība par to, ka visi ar finanšu palīdzības saņemšanu saistītie nosacījumi tiks izpildīti un atbalstāmo izdevumu atmaksa tiks saņemta, Sabiedrība saņemamo finansiālo atbalstu iekļauj ieņēmumos pirms atbalstāmo izdevumu atmaksas saņemšanas. Šī summa tiek finanšu pārskatā uzrādīta postenī “Uzkrātie ieņēmumi”."]
[null,7,"Peļņas vai zaudējumu aprēķins sagatavots atbilstoši izdevumu funkcijas metodei/ (izdevumu veidu metodei). "]

{"sheet":"Revidents","index":13,"n_rows":11,"n_cols":19,"rows_kept":11,"cut":false,"hidden":true,"merged":[[9,16,10,16],[9,18,10,19],[9,6,10,7],[9,20,10,26],[9,8,10,14],[4,12,4,14],[5,12,5,14],[7,12,7,14],[4,6,4,11],[5,6,5,11],[7,6,7,11],[6,6,6,11],[6,12,6,14],[7,18,7,23],[7,24,7,26],[4,18,4,23],[4,24,4,26],[5,18,5,23],[5,24,5,26],[6,18,6,23],[6,24,6,26]]}
[{"$f":"COLUMN(S1)-COLUMN(G1)","v":12},"xmlIdent","xmlClmn","width"]
[]
[null,null,null,null,null,null,"Informācija par revidentu",null,null,null,null,null,null,null,null,null,{"$f":"IF(Pamatdati!$H$5=Pamatdati!$Q$5,IF(Pamatdati!$H$8-1=Pamatdati!$Q$9,\"IPG\",\"PG\"),\"N\")","v":"PG"},null,"Informācija par revidentu"]
[]
[null,"RevZinDat",{"$f":"COLUMN(M5)","v":13},null,null,null,"Revidenta ziņojuma datums*",null,null,null,null,null,null,null,null,null,null,null,"Revidenta ziņojuma datums"]
[null,"RevidentsJp",{"$f":"COLUMN(M6)","v":13},null,null,null,"Zvērinātu revidentu komercsabiedrības reģistrācijas numurs*",null,null,null,null,null,null,null,null,null,null,null,"Zvērinātu revidentu komercsabiedrības reģistrācijas numurs"]
[null,"RevJpLicNr",{"$f":"COLUMN(M7)","v":13},null,null,null,"Licences numurs*",null,null,null,null,null,null,null,null,null,null,null,"Licences numurs"]
[null,"RevFpSertNr",{"$f":"COLUMN(M8)","v":13},null,null,null,"Sertifikāta numurs*",null,null,null,null,null,null,null,null,null,null,null,"Sertifikāta numurs"]
[]
[null,"RevKoment",{"$f":"COLUMN(I10)","v":9},{"$f":"CLEAN(LEFT(I10,LEN(I10)/2))","v":""},null,null,"Komentārs",null,null,null,null,null,null,null,null,null,null,null,"Komentārs"]
[null,null,null,{"$f":"CLEAN(RIGHT(I10,LEN(I10)/2))","v":""}]

{"sheet":"Instrukcija","index":14,"n_rows":46,"n_cols":18,"rows_kept":46,"cut":false,"hidden":true,"merged":[[15,2,16,15],[1,4,1,10],[2,5,2,10]]}
[]
[null,null,"Apraksts:",null,"http://exceldarbariki.mozello.lv/produkti/gpimpexp/"]
[null,null,"Kā ieslēgt makrosus:",null,null,"http://exceldarbariki.mozello.lv/produkti/instrukcijas/"]
[]
[null,"Lapas nosaukumi un lapu redzamība",null,null,null,null,null,null,null,null,null,null,null,null,null,null,null,"  Kā dabūt XML failu no EDS"]
[]
[null,null,"AKT","Aktīvi","uz lapas PMD šūnā 'F14' = x",null,null,null,null,"PMD","Pamatdati",null,"Vienmēr ir redzama"]
[null,null,"PSV","Pasīvi","uz lapas PMD šūnā 'F15' = x",null,null,null,null,"PMI","Pamatinformācija",null,"uz lapas PMD šūnā 'F13' = x"]
[null,null,"PZ1","PZA1","uz lapas PMD šūnā 'F16' = x un 'I16' = PZA1",null,null,null,null,"PvP","Pielikums vai piezīmes",null,"uz lapas PMD šūnā 'F19' = x"]
[null,null,"PZ2","PZA2","uz lapas PMD šūnā 'F16' = x un 'I16' = PZA2",null,null,null,null,"RVD","Revidents",null,"uz lapas PMD šūnā 'F20' = x"]
[null,null,"NP1","NPP1","uz lapas PMD šūnā 'F17' = x un 'I17' = NPP1",null,null,null,null,"INST","Instrukcija",null,"uz lapas PMD šūnā 'I13' nav tukšums"]
[null,null,"NP2","NPP2","uz lapas PMD šūnā 'F17' = x un 'I17' = NPP2",null,null,null,null,"ŠAP","Šabloni pielikumiem",null,"uz lapas PMD šūnā 'I19' nav tukšums"]
[null,null,"PKIP","PKIP","uz lapas PMD šūnā 'F18' = x"]
[]
[null,null,"Lai pārslēgties uz lapas gariem nosaukumiem, uz lapas PMD šūnā 'M8' jāizvēlas 'jā'"]
[null,null,"Uz ŠAP var aizpildīt tekstus, kuri būs redzami uz lapas PvP, ja stāvot uz dzeltenas šūnas atbilstošā punktā, kuram kolonnā 'BH' ir identifikators, nospiest pogu Šablons. Identifikatoram uz abām lapām jājūt vienādam. Kā variants var izmantot punkta numuru, kā identifikatoru (paraugs 1.3.)."]
[]
[]
[null,"Instrukcija - auditoriem"]
[null,null,"1. Šūnā 'K15' noradiet \"1. no EDS XML uz šo rīku\""]
[null,null,"2. Nospiediet pogu Nolasīt gada pārskatu (1). Atvērtā logā uzradiet EDS XML failu. Poga ir redzama, ja šūnā 'K15' noradiet \"1. no EDS XML uz šo rīku\""]
[null,null,"3. Ja nepieciešams ielādēt vēl vienu pārskatu, tad nospiediet pogu Nolasīt gada pārskatu (2). Atvērtā logā uzradiet EDS XML failu."]
[null,null,"    Kad ir ielādēts otrais pārskats, tas starp tiem uz katras lapas būs krāsainas šūnas. "]
[null,null,"    Ja šūna ir zaļa, tad dari rindā pilnīgi sakrīt. Ja roza, tad ir atšķirības vismaz vienā simbolā."]
[null,null,"4. Katru reizi kad tiek ielādēta informācija uz bloku 1. vai 2., "]
[null,null,"     vispirms tiek automātiski iztukšojas visas šūnas (dzeltenas kad ir 1., zaļas kad ir 2.) atbilstošā blokā."]
[null,null,"5. Ja nepieciešams iztukšot failu no datiem. Tad palaidiet datu nolasīšanu, bet atceliet faila izvēli. "]
[null,null,"    Tad dati tiks iztukšot, bet jauni netiks ielādēti. Ja izmantojat Bloku 2., tad iztukšojiet vispirms to, un tad Bloku 1."]
[null,null,"6. Ar pogu Eksportēt var eksportēt visas šī rīka lapas, kas attiecas uz EDS GP, uz tukšu failu."]
[]
[null,"Instrukcija - grāmatvežiem"]
[null,null,"1. Šūnā 'K15' noradiet \"2. uz EDS XML no šī rīka\""]
[null,null,"2. Aizpildiet visus nepieciešamus datus. Aizpildīšanai paredzētas tikai dzeltenas šūnas. "]
[null,null,"    Gaiši dzeltena - manuālai ievadīšanai, nedaudz tumši dzeltena - tur ir izkrītošais saraksts, kur var izvelēties vērtību."]
[null,null,"    Svarīgi - aizpildiet datus atbilstošā formātā - cipari, teksts datums. "]
[null,null,"    Ja tur kur jābūt datumam vai cipariem, būs teksts, tad tādi dati var neimportēties uz EDS."]
[null,null,"3. Uz vairākām lapām ir rindas kuras paslēptas vai sagrupētas."]
[null,null,"     Paslēptas rindas kuras parasti nav aktuālas Jūsu uzņēmuma lielumam (lapa PMD šūnas 'F24:F27'). Sagrupētas rindas kur nav ievadīti dati. "]
[null,null,"     Ja nepieciešams, var atvērt sagrupētas vai paslēptas rindas."]
[null,null,"     Kad fails tiek atvērts no jauna, tad notiek automātiska pārgrupēšana, un tur kur dati ir aizpildīti, rindas vairs nebūs sagrupētas."]
[null,null,"     Kā arī var veikt šo pārgrupēšanu nospiežot uz lapas PMD pogu Pārgrupēt rindas."]
[null,null,"4. Kad dati ir gatavi eksportam uz EDS, tad nospiediet pogu Sagatavot XML failu. Poga ir redzama, ja šūnā 'K15' noradiet \"2. uz EDS XML no šī rīka\""]
[null,null,"    Tad blakus šim failam tiks izveidota mape 'GP XML' un tajā tiks izveidots XML fails"]
[null,null,"    Ja nepieciešams, tad XML failu var veidot atkārtoti tik daudz cik tas ir nepieciešams. Jaunai fails tiks ierakstīt pa virsu vecam XML."]
[]
[null,"Pastāv iespēja apvienot Jūsu GP Excel formu ar šo rīku, lai savienot daļu no datiem ar formulām, kas var ietaupīt Jūsu laiku nākotnē."]

{"sheet":"<-eds-uzņ->","index":15,"n_rows":0,"n_cols":0,"rows_kept":0,"cut":false,"hidden":true,"merged":[]}

{"sheet":"Klasifikācija","index":16,"n_rows":5,"n_cols":14,"rows_kept":5,"cut":false,"hidden":true,"merged":[[3,6,3,9],[3,10,3,13],[3,2,3,3],[3,1,4,1],[3,5,4,5],[3,4,4,4]]}
[]
[null,null,null,null,null,null,{"$f":"SUM(G6:G1048576)","v":0},0,0,0,0,0,0,0]
[]
[null,"Tips","Rindas kods",null,"Konts","Nosaukums","Pārskata gads",null,null,null,"Iepriekšējais gads"]
[null,null,"Debets","Kredits",null,null,"B.Saldo","Debets","Kredīts","S.Atl","B.Saldo","Debets","Kredīts","S.Atl"]

{"sheet":"VgDati","index":17,"n_rows":4,"n_cols":19,"rows_kept":4,"cut":false,"hidden":true,"merged":[]}
[]
["Pārskata gads",null,null,null,null,null,null,null,null,null,null,"Iepriekšējā pārskata gads"]
[]
["Konts","Nosaukums","Sāk.D.Saldo","Sāk.K.Saldo","D.Apgroz.","K.Apgroz.","Beigu D.Saldo","Beigu K.Saldo",null,null,null,"Konts","Nosaukums","Sāk.D.Saldo","Sāk.K.Saldo","D.Apgroz.","K.Apgroz.","Beigu D.Saldo","Beigu K.Saldo"]

{"sheet":"TabSchema","index":18,"n_rows":39,"n_cols":9,"rows_kept":39,"cut":false,"hidden":true,"merged":[]}
[]
["R112","Nosaukums","Adrese","Lidzdaliba","Kapitals","Pelna"]
["R113","Nosaukums","Adrese","Lidzdaliba","Kapitals","Pelna"]
["R115","Veids","Nosaukums","Adrese"]
["R116","Nosaukums","Adrese","Institucija","InstitucijasAdrese","MatesNosaukums","MatesAdrese","MatesInstitucija","MatesInstitucijasAdrese"]
["R117","Darijums","Summa"]
["R204","Aplese","Korekcija","Skaidrojums","Informacija"]
["R205","Kluda","Korekcija","Iemesli","Izmainas"]
["R3010401","Kategorija","Vertiba","IzmainasPelna","IzmainasRezerve"]
["R30105","Grupa","Bilance","PatiesaVertiba","Starpiba"]
["R30106","Bilance","PatiesaVertiba","Skaidrojums"]
["R30107","Instruments","Skaits","Tiesibas"]
["R30108","Akcijas","Skaits","Vertiba","Kopsumma","UzskaitesVertiba","Ipatsvars","Iemesls"]
["R30109","Grupa","Kopsumma","Nosacijumi"]
["R3020101","Amats","IzsniegsanasDatums","Summa","Likme","SanemtaSumma","Parads","AtmaksasDatums"]
["R3020102","Amats","IzsniegsanasDatums","Summa","Likme","SanemtaSumma","Parads","AtmaksasDatums"]
["R30203","Amats","Aprekinats","Datums","Izsniegts","Parsniegums"]
["R30204","PapildusInformacija","Summa","Izmainas","Atlikums"]
["R3020501","PapildusInformacija","Summa","Izmainas","Atlikums"]
["R3020502","PapildusInformacija","Summa","Izmainas","Atlikums"]
["R401","Veids","Skaits","NominalVertiba","UzskaitesVertiba"]
["R40201","Objekts","RezerveSakuma","RezerveBeigas","Vertiba","Korekcijas","PamatlidzeklisNavParvertesana","PamatlidzeklisParvertesana"]
["R40202","Objekts","RezerveSakuma","RezerveBeigas","Vertiba","Korekcijas","PamatlidzeklisNavParvertesana","PamatlidzeklisParvertesana"]
["R40203","Objekts","RezerveSakuma","RezerveBeigas","Vertiba","Korekcijas","PamatlidzeklisNavParvertesana","PamatlidzeklisParvertesana"]
["R40204","Objekts","RezerveSakuma","RezerveBeigas","Vertiba","Korekcijas","PamatlidzeklisNavParvertesana","PamatlidzeklisParvertesana"]
["R40206","NovertesanasDatums","Laikposms"]
["R403","Instruments","VertibaSakuma","VertibaBeigas","Starpiba"]
["R404","Veids","RasanasLaiks","SegsanasLaiks","Summa","LikmesIzmainas"]
["R40504","Veids","Summa","PapildusSniegtaInformacija"]
["R40505","Summa","PapildusSniegtaInformacija"]
["R40506","Veids","Summa","PapildusSniegtaInformacija"]
["R50101","Nace","Summa"]
["R50102","Valsts","Summa"]
["R502","Sniedzejs","Gads","Summa","Merkis","Nosacijumi","AtmaksajamaSumma"]
["R504","Objekts","Bilance","Ienemumi","Izdevumi","Bruto","Pelna"]
["R505","Pasutitajs","Izmaksas","Ienemumi","Zaudejumi","Avansi","Aiztureti"]
["R506","Veids","Summa"]
["R507","Objekts","Bilance","Samazinajums","BilanceBeigas"]
["R6","PostenisNo","PostenisUz","Summa"]

{"sheet":"Saraksti","index":19,"n_rows":77,"n_cols":3,"rows_kept":77,"cut":false,"hidden":true,"merged":[]}
[]
[null,"PP_4.5.4.","Xml"]
[null,"1.1. - Aizņēmumi pret obligācijām, kuru samaksas termiņš ilgāks par 5 gadiem (likuma 52.panta pirmās daļas 5.punkts)"]
[null,"1.2. - Aizņēmumi pret obligācijām, kuri segti ar nodrošinājumu, norādot nodrošinājuma veidu un formu (likuma 52.panta pirmās daļas 5.punkts)"]
[null,"2.1. - Akcijās pārvēršamie aizņēmumi kuru samaksas termiņš ilgāks par 5 gadiem (likuma 52.panta pirmās daļas 5.punkts)"]
[null,"2.2. - Akcijās pārvēršamie aizņēmumi, kuri segti ar nodrošinājumu, norādot nodrošinājuma veidu un formu (likuma 52.panta pirmās daļas 5.punkts)"]
[null,"3.1. - Aizņēmumi no kredītiestādēm, kuru samaksas termiņš ilgāks par 5 gadiem (likuma 52.panta pirmās daļas 5.punkts)"]
[null,"3.2. - Aizņēmumi no kredītiestādēm, kuri segti ar nodrošinājumu, norādot nodrošinājuma veidu un formu (likuma 52.panta pirmās daļas 5.punkts)"]
[null,"4.1. - Citi aizņēmumi, kuru samaksas termiņš ilgāks par 5 gadiem (likuma 52.panta pirmās daļas 5.punkts)"]
[null,"4.2. - Citi aizņēmumi, kuri segti ar nodrošinājumu, norādot nodrošinājuma veidu un formu (likuma 52.panta pirmās daļas 5.punkts)"]
[null,"5.1. - Aizņēmumi no radniecīgajām sabiedrībām, kuru samaksas termiņš ilgāks par 5 gadiem (likuma 52.panta pirmās daļas 5.punkts)"]
[null,"5.2. - Aizņēmumi no radniecīgajām sabiedrībām, kuri segti ar nodrošinājumu, norādot nodrošinājuma veidu un formu (likuma 52.panta pirmās daļas 5.punkts)"]
[null,"6.1. - Aizņēmumi no asociētajām sabiedrībām, kuru samaksas termiņš ilgāks par 5 gadiem (likuma 52.panta pirmās daļas 5.punkts)"]
[null,"6.2. - Aizņēmumi no asociētajām sabiedrībām, kuri segti ar nodrošinājumu, norādot nodrošinājuma veidu un formu (likuma 52.panta pirmās daļas 5.punkts)"]
[null,"7.1. - Maksājamie vekseļi, kuru samaksas termiņš ir ilgāks par 5 gadiem (likuma 52. panta pirmās daļas 5. punkts)"]
[null,"7.2. - Maksājamie vekseļi, kuri segti ar nodrošinājumu, norādot nodrošinājuma veidu un formu (likuma 52.panta pirmās daļas 5.punkts)"]
[]
[null,"PP_4.5.6."]
[null,"1.1. - Parādi piegādātājiem un darbuzņēmējiem, kuru samaksas termiņš ilgāks par 5 gadiem pēc bilances datuma (likuma 52.panta pirmās daļas 5.punkts)"]
[null,"1.2. - Parādi piegādātājiem un darbuzņēmējiem, kuri segti ar nodrošinājumu, norādot nodrošinājuma veidu un formu (likuma 52.panta pirmās daļas 5.punkts)"]
[null,"2.1. - No pircējiem saņemtie avansi, kuru segšanas termiņš ilgāks par 5 gadiem pēc bilances datuma (likuma 52.panta pirmās daļas 5.punkts)"]
[null,"2.2. - No pircējiem saņemtie avansi, kuri segti ar nodrošinājumu, norādot nodrošinājuma veidu un formu (likuma 52.panta pirmās daļas 5.punkts)"]
[null,"3.1. - Pārējo kreditoru parādi, kuru samaksas termiņš ilgāks par 5 gadiem pēc bilances datuma (likuma 52.panta pirmās daļas 5.punkts)"]
[null,"3.2. - Pārējie kreditoru parādi, kuri segti ar nodrošinājumu, norādot nodrošinājuma veidu un formu (likuma 52.panta pirmās daļas 5.punkts)"]
[null,"4. - Neizmaksātās dividendes, kuru izmaksas termiņš ir ilgāks par 5 gadiem pēc bilances datuma"]
[]
[null,"PP_3.1.7."]
[null,"Līdzdalības apliecības",1]
[null,"Regulētā tirgū tirgotas garantijas",2]
[null,"Iespējas līgumi",3]
[]
[null,"PP_3.1.8."]
[null,"Atpirktās",1]
[null,"Pārdotās",2]
[null,"Iegūtās un turētās",3]
[]
[null,"PM_6"]
[null,"Saimnieciskā darbība tiek turpināta pilnā vai ierobežotā apjomā",1]
[null,"Saimnieciskā darbība tiek izbeigta",2]
[]
[null,"PZAType"]
[null,"PZA1 - Klasificēts pēc izdevumu veidiem",1]
[null,"PZA2 - Klasificēts pēc izdevumu funkcijām",2]
[]
[null,"NPPType"]
[null,"NPP1 - NPP pēc tiešās metodes",1]
[null,"NPP2 - NPP pēc netiešās metodes",2]
[]
[null,"PM_10"]
[null,"euro","V"]
[null,"tukstoši euro","T"]
[null,"miljoni euro","M"]
[]
[null,"PM_12"]
[null,"Kapitālsabiedrība",1]
[null,"Personālsabiedrība",2]
[null,"Kooperatīva sabiedrība",3]
[null,"Individuālais uzņēmums, zemnieka vai zvejnieka saimniecība",4]
[]
[null,"PM_13"]
[null,"uzņēmuma grāmatvedis",1]
[null,"ārpakalpojuma grāmatvedis",2]
[null,"valdes loceklis",3]
[]
[null,"PP_1.15."]
[null,"Sabiedrība ar ierobežotu atbildību",1]
[null,"Akciju sabiedrība",2]
[]
[null,"PP_4.1."]
[null,"Parastās",1]
[null,"Priekšrocību",2]
[null,"Personāla",3]
[]
[null,"Gp tips"]
[null,"Uzņēmuma gada pārskats","UGP"]
[null,"Konsolidētais uzņēmuma gada pārskats","UKGP"]
[null,"Biedrības, nodibinājuma un arodbiedrības gada pārskats","BNAGPv3"]

{"sheet":"Tiesibas","index":20,"n_rows":35,"n_cols":15,"rows_kept":35,"cut":false,"hidden":true,"merged":[]}
[]
[null,null,null,"DatumsNo","2025-09-09",null,null,"TisWbName","ThisWbCustId","RN","ActivationDate","CompName/Path","Processor/HddSerialId","PROCESSOR_REVISION","USERNAME"]
[null,null,null,"DatumsLidz","2025-09-20",null,null,"GPB",1,25,"2020-09-09","-","-","-","-"]
[null,null,null,"Skaitītājs"]
[]
[null,null,null,"ThisWbName","GPB"]
[null,null,null,"ThisWbCustId",1]
[null,null,null,"Limenis","D"]
[]
[null,null,null,"Nesakonfigurētas tiesības!"]
[null,null,null,"Nesakonfigurētas tiesības versijai!"]
[null,null,null,"Versijas periods ir beidzies!"]
[null,null,null,"Versijas apstrādes uzņēmuma RegNr neatbilst definētam!"]
[null,null,null,"Izvelētais RegNr nav definēts šajā versijā!"]
[null,null,null,"Lūdzu aizpildiet reģistrācijas numuru!"]
[null,null,null,"Versijas Importa/Eksporta skaits sasniedza 20!"]
[null,null,null,"Lūdzu veikt faila aktivāciju uz lapas \"Instrukcija\"!"]
[null,null,null,"Fails jau ir aktivizēts šim datoram un lietotājam!"]
[]
[]
[null,null,null,"Īstais","Garais"]
[null,null,null,"PMD","Pamatdati"]
[null,null,null,"PMI","Pamatinformācija"]
[null,null,null,"AKT","Aktīvi"]
[null,null,null,"PSV","Pasīvi"]
[null,null,null,"PZ1","PZA1"]
[null,null,null,"PZ2","PZA2"]
[null,null,null,"NP1","NPP1"]
[null,null,null,"NP2","NPP2"]
[null,null,null,"PvP","Pielikums vai piezīmes"]
[null,null,null,"ŠAP","Šabloni pielikumiem"]
[null,null,null,"RVD","Revidents"]
[null,null,null,"INST","Instrukcija"]
[null,null,null,"VG","VgDati"]
[null,null,null,"KLAS","Klasifikācija"]

{"sheet":"Format","index":21,"n_rows":13,"n_cols":14,"rows_kept":13,"cut":false,"hidden":true,"merged":[]}
["B_F+"]
[null,null,null,null,null,null,null,null,null,null,{"$f":"ROUND(SUMIFS(Klasifikācija!$G:$G,Klasifikācija!$B:$B,\"B\",Klasifikācija!$C:$C,$J2,Klasifikācija!$G:$G,\">0\")+SUMIFS(Klasifikācija!$G:$G,Klasifikācija!$B:$B,\"B\",Klasifikācija!$D:$D,$J2,Klasifikācija!$G:$G,\"<0\"),0)","v":0},{"$f":"ROUND(SUMIFS(Klasifikācija!$K:$K,Klasifikācija!$B:$B,\"B\",Klasifikācija!$C:$C,$J2,Klasifikācija!$K:$K,\">0\")+SUMIFS(Klasifikācija!$K:$K,Klasifikācija!$B:$B,\"B\",Klasifikācija!$D:$D,$J2,Klasifikācija!$K:$K,\"<0\"),0)","v":0}]
["P2_F ien"]
[null,null,null,null,null,null,null,null,null,null,{"$f":"-ROUND(SUMIFS(Klasifikācija!$I:$I,Klasifikācija!$B:$B,\"P2\",Klasifikācija!$D:$D,$J4)+SUMIFS(Klasifikācija!$H:$H,Klasifikācija!$B:$B,\"P2\",Klasifikācija!$C:$C,$J4),0)","v":0},{"$f":"-ROUND(SUMIFS(Klasifikācija!$M:$M,Klasifikācija!$B:$B,\"P2\",Klasifikācija!$D:$D,$J4)+SUMIFS(Klasifikācija!$L:$L,Klasifikācija!$B:$B,\"P2\",Klasifikācija!$C:$C,$J4),0)","v":0}]
["B_F_P2"]
[null,null,null,null,null,null,null,null,null,null,{"$f":"'PZA2'!$K$38","v":0},{"$f":"'PZA2'!$L$38","v":0}]
["Klas_FMT"]
[null,null,null,null,null,null,{"$f":"SUMIFS(VgDati!$G:$G,VgDati!$A:$A,$E8)-SUMIFS(VgDati!$H:$H,VgDati!$A:$A,$E8)","v":0},{"$f":"SUMIFS(VgDati!$E:$E,VgDati!$A:$A,$E8)","v":0},{"$f":"-SUMIFS(VgDati!$F:$F,VgDati!$A:$A,$E8)","v":0},{"$f":"SUMIFS(VgDati!$C:$C,VgDati!$A:$A,$E8)-SUMIFS(VgDati!$D:$D,VgDati!$A:$A,$E8)","v":0},{"$f":"SUMIFS(VgDati!$R:$R,VgDati!$L:$L,$E8)-SUMIFS(VgDati!$S:$S,VgDati!$L:$L,$E8)","v":0},{"$f":"SUMIFS(VgDati!$P:$P,VgDati!$L:$L,$E8)","v":0},{"$f":"-SUMIFS(VgDati!$Q:$Q,VgDati!$L:$L,$E8)","v":0},{"$f":"SUMIFS(VgDati!$N:$N,VgDati!$L:$L,$E8)-SUMIFS(VgDati!$O:$O,VgDati!$L:$L,$E8)","v":0}]
[]
["B_F-"]
[null,null,null,null,null,null,null,null,null,null,{"$f":"-ROUND(SUMIFS(Klasifikācija!$G:$G,Klasifikācija!$B:$B,\"B\",Klasifikācija!$C:$C,$J11,Klasifikācija!$G:$G,\">0\")+SUMIFS(Klasifikācija!$G:$G,Klasifikācija!$B:$B,\"B\",Klasifikācija!$D:$D,$J11,Klasifikācija!$G:$G,\"<0\"),0)","v":0},{"$f":"-ROUND(SUMIFS(Klasifikācija!$K:$K,Klasifikācija!$B:$B,\"B\",Klasifikācija!$C:$C,$J11,Klasifikācija!$K:$K,\">0\")+SUMIFS(Klasifikācija!$K:$K,Klasifikācija!$B:$B,\"B\",Klasifikācija!$D:$D,$J11,Klasifikācija!$K:$K,\"<0\"),0)","v":0}]
["P2_F izm"]
[null,null,null,null,null,null,null,null,null,null,{"$f":"ROUND(SUMIFS(Klasifikācija!$I:$I,Klasifikācija!$B:$B,\"P2\",Klasifikācija!$D:$D,$J13)+SUMIFS(Klasifikācija!$H:$H,Klasifikācija!$B:$B,\"P2\",Klasifikācija!$C:$C,$J13),0)","v":0},{"$f":"ROUND(SUMIFS(Klasifikācija!$M:$M,Klasifikācija!$B:$B,\"P2\",Klasifikācija!$D:$D,$J13)+SUMIFS(Klasifikācija!$L:$L,Klasifikācija!$B:$B,\"P2\",Klasifikācija!$C:$C,$J13),0)","v":0}]

{"sheet":"VgKlas","index":22,"n_rows":1,"n_cols":4,"rows_kept":1,"cut":false,"hidden":true,"merged":[]}
["Tips","Debets","Kredits","Konts"]